{"text_format":"1","workbook":"xlsx","n_sheets":3,"sheets":["Sheet1","Sheet2","Tabelle1"],"not_rendered":{"charts":0,"images":0,"macros":1,"external_links":0,"defined_names":0,"comments":0,"pivot_tables":0},"unopened":[],"bounds":{"document_bytes":16777216,"sheet_cells":100000,"rows_first":2000,"rows_last":500,"rows_between":2000,"halvings":0,"cell_chars":16384,"cell_head_chars":4096},"cells_cut":0,"cells_raw":0,"read":"whole","date_system":"1900"}

{"sheet":"Sheet1","index":0,"n_rows":37,"n_cols":136,"rows_kept":37,"cut":false,"hidden":false,"merged":[[2,0,2,3],[1,0,1,3],[0,0,0,3]]}
[null,null,null,null,"Race","Tour of Tasmania","Down Under Classic","Gisborne GP","Tour Down Under","Tour of Qatar","Vuelta al Tachira","Hong Kong Challenge","Franceville Classique","Clasico San Jose","Volta a Portugal","Copenhagen-Malmo TTT","Omloop Het Nieuwsblad","Viana do Castelo","Gent - Wevelgem","GP Herning","Tirreno-Adriatico","Paris-Nice","Classique du Grand-Duché","Volta a Catalunya","Tour of Ukraine","Tour of Southland","Pro Hallstatt Classic","Milano San Remo","Geraardsbergen-Bosberg","Barbados Cycling Festival","Jelajah SKL","Strada Appia Antica","Vuelta al Pais Vasco","Badaling International","Circulo de Juarez","Praha - Karlovy Vary - Praha","Vuelta a Colombia","Ronde van Nederland","Coppa Placci","Strade Bianche","Tour of Eritrea","Ronde van Vlaanderen","E3 Prijs","Kuurne - Bruxelles - Kuurne","Paris - Roubaix","Tour of California","Giro d'Italia","Baltic Chain Tour","Macskako Kerekparverseny","Tour de Pologne","GP Izola","GP Liechtenstein","Roma Maxima","GP Wallonie","Lincoln GP","USA Pro Cycling Challenge","Veenendaal - Veenendaal","Lisbon Classic","Amstel Gold Race","Nakhon Ratchasima Trophy","Cheshire Cycling Tour","Tour de Romandie","Fleche Wallone","Liege - Bastogne - Liege","Chrono d'Arenberg","Rund um Koln","Vuelta a Espana","Tour of Chile","Tour du Faso","Int. Osterreich Rundfahrt","1 Jour de Dunkerque","Olympia's Tour","Frankfurt Eschborn","Tour of Norway","Tour of Japan","Hanko Classic","Tour of Vancouver","Riga - Jurmala GP","Tour de Suisse","Tour of East Java","Ras Tailteann","Criterium du Dauphine Libere","Tour of South Africa","Giro del Trentino","Monterrey TTT","Apex Mountain Classic","Scandinavia Open Road Race","Torshavn GP","Uppsala Classic","Tour de France","Tour of the Middle East","Celtic Chrono","Tour de Vineyards","Philadelphia International Championship","Kenya Mountain Classic","Tour of Lithuania","Betonexpressz GP","Tour d'Andorra","Tour of Slovenie","Chrono des Herbiers","Benelux Challenge","Deutschland Tour","Sakartvelo Trophy","Clasica San Sebastian","Tour de Langkawi","Post Danmark Rundt","GP Moscow","SAA Tour d'Afrique","Tour of Britain","East Midlands Cicle Classic","Paris Tours","GP Kigali","Arab Tour","Tour of America","Balkans International","Euskal Bizikleta","Tour of Northern Europe","Lillestrom GP","Tour of the Battenkill","Rheden GP","Milano - Torino","GP Lugano","Tour de Maroc","Japan Cup","Vilnius GP","Herald Sun Tour","Course de Solidarnosc","Bayern Rundfahrt","Grands Prix Cyclistes","Giro di Lombardia","Giro dell'Emelia","Zuri Metzgete"]
[{"$f":"IF(SUM(EE5:EE35)=0,\"No race clashes with any rider\",\"One or more riders has a race clash issue\")","v":"No race clashes with any rider"},null,null,null,"Race Points Cost",0,2,2,6,0,10,3,2,2,9,0,2,2,2,2,0,0,0,6,3,5,2,0,2,4,4,0,6,2,5,0,6,0,2,2,6,0,2,2,0,7,0,5,2,7,2,0,2,2,2,4,2,2,0,2,5,6,0,0,2,0,0,3,3,7,2,6,2,5,6,2,7,2,0,2,3,0,6,3,2,2,3,2,2,0,4,2,7,2,2,4,2,5,5,0,6,5,2,2,7,5,0,4,5,0,2,2,5,21,8,4,0,2,2,2,2,2,8,2,2,5,4,4,0,0,2,2,"-"]
[{"$f":"IF(SUM(ED5:ED35)=0,\"All riders within race day allocation\",\"One or more riders are above their race day allocation\")","v":"All riders within race day allocation"},null,null,null,"Riders Allowed",8,8,8,8,8,8,8,8,8,8,8,8,8,8,8,8,8,8,8,8,8,8,8,8,8,8,8,8,8,8,8,8,8,8,8,8,8,8,8,8,8,8,8,8,8,8,8,8,8,8,8,8,8,8,8,8,8,8,8,3,8,8,8,8,8,8,8,8,8,8,8,8,8,8,8,8,8,8,8,8,8,8,8,8,8,8,3,8,8,8,8,8,8,8,3,8,8,8,8,8,8,8,8,8,8,8,8,8,8,8,8,8,8,8,8,8,8,8,8,8,8,8,8,8,8,8,8,"-"]
["Rider ID","Surname","First Name","Race Points Limit","Race Points Assigned",0,0,1,0,0,0,1,0,1,0,0,0,0,1,1,0,0,0,1,0,1,0,0,1,1,0,0,0,1,1,0,0,0,1,0,1,0,0,1,0,1,0,1,0,0,1,0,0,0,1,1,0,0,0,1,0,0,0,0,0,0,0,0,1,0,0,1,1,0,0,1,1,0,0,0,1,0,0,1,1,0,0,0,1,0,1,1,0,0,0,0,1,0,0,0,0,0,1,0,1,1,0,0,0,0,0,1,1,0,0,1,0,1,0,0,0,0,0,0,1,1,1,1,0,0,0,1,"Race Day Use","RD","RC","Race Clashes"]
[null,null,null,null,{"$f":"(F5*$F$2)+(G5*$G$2)+(H5*$H$2)+(I5*$I$2)+(J5*$J$2)+(K5*$K$2)+(L5*$L$2)+(M5*$M$2)+(N5*$N$2)+(O5*$O$2)+(P5*$P$2)+(Q5*$Q$2)+(R5*$R$2)+(S5*$S$2)+(T5*$T$2)+(U5*$U$2)+(V5*$V$2)+(W5*$W$2)+(X5*$X$2)+(Y5*$Y$2)+(Z5*$Z$2)+(AA5*$AA$2)+(AB5*$AB$2)+(AC5*$AC$2)+(AD5*$AD$2)+(AE5*$AE$2)+(AF5*$AF$2)+(AG5*$AG$2)+(AH5*$AH$2)+(AI5*$AI$2)+(AJ5*$AJ$2)+(AK5*$AK$2)+(AL5*$AL$2)+(AM5*$AM$2)+(AN5*$AN$2)+(AO5*$AO$2)+(AP5*$AP$2)+(AQ5*$AQ$2)+(AR5*$AR$2)+(AS5*$AS$2)+(AT5*$AT$2)+(AU5*$AU$2)+(AV5*$AV$2)+(AW5*$AW$2)+(AX5*$AX$2)+(AY5*$AY$2)+(AZ5*$AZ$2)+(BA5*$BA$2)+(BB5*$BB$2)+(BC5*$BC$2)+(BD5*$BD$2)+(BE5*$BE$2)+(BF5*$BF$2)+(BG5*$BG$2)+(BH5*$BH$2)+(BI5*$BI$2)+(BJ5*$BJ$2)+(BK5*$BK$2)+(BL5*$BL$2)+(BM5*$BM$2)+(BN5*$BN$2)+(BO5*$BO$2)+(BP5*$BP$2)+(BQ5*$BQ$2)+(BR5*$BR$2)+(BS5*$BS$2)+(BT5*$BT$2)+(BU5*$BU$2)+(BV5*$BV$2)+(BW5*$BW$2)+(BX5*$BX$2)+(BY5*$BY$2)+(BZ5*$BZ$2)+(CA5*$CA$2)+(CB5*$CB$2)+(CC5*$CC$2)+(CD5*$CD$2)+(CE5*$CE$2)+(CF5*$CF$2)+(CG5*$CG$2)+(CH5*$CH$2)+(CI5*$CI$2)+(CJ5*$CJ$2)+(CK5*$CK$2)+(CL5*$CL$2)+(CM5*$CM$2)+(CN5*$CN$2)+(CO5*$CO$2)+(CP5*$CP$2)+(CQ5*$CQ$2)+(CR5*$CR$2)+(CS5*$CS$2)+(CT5*$CT$2)+(CU5*$CU$2)+(CV5*$CV$2)+(CW5*$CW$2)+(CX5*$CX$2)+(CY5*$CY$2)+(CZ5*$CZ$2)+(DA5*$DA$2)+(DB5*$DB$2)+(DC5*$DC$2)+(DD5*$DD$2)+(DE5*$DE$2)+(DF5*$DF$2)+(DG5*$DG$2)+(DH5*$DH$2)+(DI5*$DI$2)+(DJ5*$DJ$2)+(DK5*$DK$2)+(DL5*$DL$2)+(DM5*$DM$2)+(DN5*$DN$2)+(DP5*$DP$2)+(DQ5*$DQ$2)+(DR5*$DR$2)+(DO5*$DO$2)+(DS5*$DS$2)+(DT5*$DT$2)+(DU5*$DU$2)+(DV5*$DV$2)+(DW5*$DW$2)+(DX5*$DX$2)+(DY5*$DY$2)+(DZ5*$DZ$2)+(EA5*$EA$2)+(EB5*$EB$2)","v":0},null,null,null,null,null,null,null,null,null,null,null,null,null,null,null,null,null,null,null,null,null,null,null,null,null,null,null,null,null,null,null,null,null,null,null,null,null,null,null,null,null,null,null,null,null,null,null,null,null,null,null,null,null,null,null,null,null,null,null,null,null,null,null,null,null,null,null,null,null,null,null,null,null,null,null,null,null,null,null,null,null,null,null,null,null,null,null,null,null,null,null,null,null,null,null,null,null,null,null,null,null,null,null,null,null,null,null,null,null,null,null,null,null,null,null,null,null,null,null,null,null,null,null,null,null,null,null,{"$f":"IF(ED5=1,\"Error\",\"Good\")","v":"Good"},{"$f":"IF((D5-E5)<0,1,0)","v":0},0,{"$f":"IF(EE5=1,\"Error\",\"Good\")","v":"Good"}]
[null,null,null,null,{"$f":"(F6*$F$2)+(G6*$G$2)+(H6*$H$2)+(I6*$I$2)+(J6*$J$2)+(K6*$K$2)+(L6*$L$2)+(M6*$M$2)+(N6*$N$2)+(O6*$O$2)+(P6*$P$2)+(Q6*$Q$2)+(R6*$R$2)+(S6*$S$2)+(T6*$T$2)+(U6*$U$2)+(V6*$V$2)+(W6*$W$2)+(X6*$X$2)+(Y6*$Y$2)+(Z6*$Z$2)+(AA6*$AA$2)+(AB6*$AB$2)+(AC6*$AC$2)+(AD6*$AD$2)+(AE6*$AE$2)+(AF6*$AF$2)+(AG6*$AG$2)+(AH6*$AH$2)+(AI6*$AI$2)+(AJ6*$AJ$2)+(AK6*$AK$2)+(AL6*$AL$2)+(AM6*$AM$2)+(AN6*$AN$2)+(AO6*$AO$2)+(AP6*$AP$2)+(AQ6*$AQ$2)+(AR6*$AR$2)+(AS6*$AS$2)+(AT6*$AT$2)+(AU6*$AU$2)+(AV6*$AV$2)+(AW6*$AW$2)+(AX6*$AX$2)+(AY6*$AY$2)+(AZ6*$AZ$2)+(BA6*$BA$2)+(BB6*$BB$2)+(BC6*$BC$2)+(BD6*$BD$2)+(BE6*$BE$2)+(BF6*$BF$2)+(BG6*$BG$2)+(BH6*$BH$2)+(BI6*$BI$2)+(BJ6*$BJ$2)+(BK6*$BK$2)+(BL6*$BL$2)+(BM6*$BM$2)+(BN6*$BN$2)+(BO6*$BO$2)+(BP6*$BP$2)+(BQ6*$BQ$2)+(BR6*$BR$2)+(BS6*$BS$2)+(BT6*$BT$2)+(BU6*$BU$2)+(BV6*$BV$2)+(BW6*$BW$2)+(BX6*$BX$2)+(BY6*$BY$2)+(BZ6*$BZ$2)+(CA6*$CA$2)+(CB6*$CB$2)+(CC6*$CC$2)+(CD6*$CD$2)+(CE6*$CE$2)+(CF6*$CF$2)+(CG6*$CG$2)+(CH6*$CH$2)+(CI6*$CI$2)+(CJ6*$CJ$2)+(CK6*$CK$2)+(CL6*$CL$2)+(CM6*$CM$2)+(CN6*$CN$2)+(CO6*$CO$2)+(CP6*$CP$2)+(CQ6*$CQ$2)+(CR6*$CR$2)+(CS6*$CS$2)+(CT6*$CT$2)+(CU6*$CU$2)+(CV6*$CV$2)+(CW6*$CW$2)+(CX6*$CX$2)+(CY6*$CY$2)+(CZ6*$CZ$2)+(DA6*$DA$2)+(DB6*$DB$2)+(DC6*$DC$2)+(DD6*$DD$2)+(DE6*$DE$2)+(DF6*$DF$2)+(DG6*$DG$2)+(DH6*$DH$2)+(DI6*$DI$2)+(DJ6*$DJ$2)+(DK6*$DK$2)+(DL6*$DL$2)+(DM6*$DM$2)+(DN6*$DN$2)+(DP6*$DP$2)+(DQ6*$DQ$2)+(DR6*$DR$2)+(DO6*$DO$2)+(DS6*$DS$2)+(DT6*$DT$2)+(DU6*$DU$2)+(DV6*$DV$2)+(DW6*$DW$2)+(DX6*$DX$2)+(DY6*$DY$2)+(DZ6*$DZ$2)+(EA6*$EA$2)+(EB6*$EB$2)","v":0},null,null,null,null,null,null,null,null,null,null,null,null,null,null,null,null,null,null,null,null,null,null,null,null,null,null,null,null,null,null,null,null,null,null,null,null,null,null,null,null,null,null,null,null,null,null,null,null,null,null,null,null,null,null,null,null,null,null,null,null,null,null,null,null,null,null,null,null,null,null,null,null,null,null,null,null,null,null,null,null,null,null,null,null,null,null,null,null,null,null,null,null,null,null,null,null,null,null,null,null,null,null,null,null,null,null,null,null,null,null,null,null,null,null,null,null,null,null,null,null,null,null,null,null,null,null,null,{"$f":"IF(ED6=1,\"Error\",\"Good\")","v":"Good"},0,0,{"$f":"IF(EE6=1,\"Error\",\"Good\")","v":"Good"}]
[null,null,null,null,0,null,null,null,null,null,null,null,null,null,null,null,null,null,null,null,null,null,null,null,null,null,null,null,null,null,null,null,null,null,null,null,null,null,null,null,null,null,null,null,null,null,null,null,null,null,null,null,null,null,null,null,null,null,null,null,null,null,null,null,null,null,null,null,null,null,null,null,null,null,null,null,null,null,null,null,null,null,null,null,null,null,null,null,null,null,null,null,null,null,null,null,null,null,null,null,null,null,null,null,null,null,null,null,null,null,null,null,null,null,null,null,null,null,null,null,null,null,null,null,null,null,null,null,null,null,null,null,"Good",0,0,{"$f":"IF(EE7=1,\"Error\",\"Good\")","v":"Good"}]
[null,null,null,null,0,null,null,null,null,null,null,null,null,null,null,null,null,null,null,null,null,null,null,null,null,null,null,null,null,null,null,null,null,null,null,null,null,null,null,null,null,null,null,null,null,null,null,null,null,null,null,null,null,null,null,null,null,null,null,null,null,null,null,null,null,null,null,null,null,null,null,null,null,null,null,null,null,null,null,null,null,null,null,null,null,null,null,null,null,null,null,null,null,null,null,null,null,null,null,null,null,null,null,null,null,null,null,null,null,null,null,null,null,null,null,null,null,null,null,null,null,null,null,null,null,null,null,null,null,null,null,null,"Good",0,0,"Good"]
[null,null,null,null,0,null,null,null,null,null,null,null,null,null,null,null,null,null,null,null,null,null,null,null,null,null,null,null,null,null,null,null,null,null,null,null,null,null,null,null,null,null,null,null,null,null,null,null,null,null,null,null,null,null,null,null,null,null,null,null,null,null,null,null,null,null,null,null,null,null,null,null,null,null,null,null,null,null,null,null,null,null,null,null,null,null,null,null,null,null,null,null,null,null,null,null,null,null,null,null,null,null,null,null,null,null,null,null,null,null,null,null,null,null,null,null,null,null,null,null,null,null,null,null,null,null,null,null,null,null,null,null,"Good",0,0,"Good"]
[null,null,null,null,0,null,null,null,null,null,null,null,null,null,null,null,null,null,null,null,null,null,null,null,null,null,null,null,null,null,null,null,null,null,null,null,null,null,null,null,null,null,null,null,null,null,null,null,null,null,null,null,null,null,null,null,null,null,null,null,null,null,null,null,null,null,null,null,null,null,null,null,null,null,null,null,null,null,null,null,null,null,null,null,null,null,null,null,null,null,null,null,null,null,null,null,null,null,null,null,null,null,null,null,null,null,null,null,null,null,null,null,null,null,null,null,null,null,null,null,null,null,null,null,null,null,null,null,null,null,null,null,"Good",0,0,"Good"]
[null,null,null,null,0,null,null,null,null,null,null,null,null,null,null,null,null,null,null,null,null,null,null,null,null,null,null,null,null,null,null,null,null,null,null,null,null,null,null,null,null,null,null,null,null,null,null,null,null,null,null,null,null,null,null,null,null,null,null,null,null,null,null,null,null,null,null,null,null,null,null,null,null,null,null,null,null,null,null,null,null,null,null,null,null,null,null,null,null,null,null,null,null,null,null,null,null,null,null,null,null,null,null,null,null,null,null,null,null,null,null,null,null,null,null,null,null,null,null,null,null,null,null,null,null,null,null,null,null,null,null,null,"Good",0,0,"Good"]
[null,null,null,null,0,null,null,null,null,null,null,null,null,null,null,null,null,null,null,null,null,null,null,null,null,null,null,null,null,null,null,null,null,null,null,null,null,null,null,null,null,null,null,null,null,null,null,null,null,null,null,null,null,null,null,null,null,null,null,null,null,null,null,null,null,null,null,null,null,null,null,null,null,null,null,null,null,null,null,null,null,null,null,null,null,null,null,null,null,null,null,null,null,null,null,null,null,null,null,null,null,null,null,null,null,null,null,null,null,null,null,null,null,null,null,null,null,null,null,null,null,null,null,null,null,null,null,null,null,null,null,null,"Good",0,0,"Good"]
[null,null,null,null,0,null,null,null,null,null,null,null,null,null,null,null,null,null,null,null,null,null,null,null,null,null,null,null,null,null,null,null,null,null,null,null,null,null,null,null,null,null,null,null,null,null,null,null,null,null,null,null,null,null,null,null,null,null,null,null,null,null,null,null,null,null,null,null,null,null,null,null,null,null,null,null,null,null,null,null,null,null,null,null,null,null,null,null,null,null,null,null,null,null,null,null,null,null,null,null,null,null,null,null,null,null,null,null,null,null,null,null,null,null,null,null,null,null,null,null,null,null,null,null,null,null,null,null,null,null,null,null,"Good",0,0,"Good"]
[null,null,null,null,0,null,null,null,null,null,null,null,null,null,null,null,null,null,null,null,null,null,null,null,null,null,null,null,null,null,null,null,null,null,null,null,null,null,null,null,null,null,null,null,null,null,null,null,null,null,null,null,null,null,null,null,null,null,null,null,null,null,null,null,null,null,null,null,null,null,null,null,null,null,null,null,null,null,null,null,null,null,null,null,null,null,null,null,null,null,null,null,null,null,null,null,null,null,null,null,null,null,null,null,null,null,null,null,null,null,null,null,null,null,null,null,null,null,null,null,null,null,null,null,null,null,null,null,null,null,null,null,{"$f":"IF(ED14=1,\"Error\",\"Good\")","v":"Good"},0,0,{"$f":"IF(EE14=1,\"Error\",\"Good\")","v":"Good"}]
[null,null,null,null,0,null,null,null,null,null,null,null,null,null,null,null,null,null,null,null,null,null,null,null,null,null,null,null,null,null,null,null,null,null,null,null,null,null,null,null,null,null,null,null,null,null,null,null,null,null,null,null,null,null,null,null,null,null,null,null,null,null,null,null,null,null,null,null,null,null,null,null,null,null,null,null,null,null,null,null,null,null,null,null,null,null,null,null,null,null,null,null,null,null,null,null,null,null,null,null,null,null,null,null,null,null,null,null,null,null,null,null,null,null,null,null,null,null,null,null,null,null,null,null,null,null,null,null,null,null,null,null,{"$f":"IF(ED15=1,\"Error\",\"Good\")","v":"Good"},0,0,{"$f":"IF(EE15=1,\"Error\",\"Good\")","v":"Good"}]
[null,null,null,null,0,null,null,null,null,null,null,null,null,null,null,null,null,null,null,null,null,null,null,null,null,null,null,null,null,null,null,null,null,null,null,null,null,null,null,null,null,null,null,null,null,null,null,null,null,null,null,null,null,null,null,null,null,null,null,null,null,null,null,null,null,null,null,null,null,null,null,null,null,null,null,null,null,null,null,null,null,null,null,null,null,null,null,null,null,null,null,null,null,null,null,null,null,null,null,null,null,null,null,null,null,null,null,null,null,null,null,null,null,null,null,null,null,null,null,null,null,null,null,null,null,null,null,null,null,null,null,null,"Good",0,0,"Good"]
[null,null,null,null,0,null,null,null,null,null,null,null,null,null,null,null,null,null,null,null,null,null,null,null,null,null,null,null,null,null,null,null,null,null,null,null,null,null,null,null,null,null,null,null,null,null,null,null,null,null,null,null,null,null,null,null,null,null,null,null,null,null,null,null,null,null,null,null,null,null,null,null,null,null,null,null,null,null,null,null,null,null,null,null,null,null,null,null,null,null,null,null,null,null,null,null,null,null,null,null,null,null,null,null,null,null,null,null,null,null,null,null,null,null,null,null,null,null,null,null,null,null,null,null,null,null,null,null,null,null,null,null,"Good",0,0,"Good"]
[null,null,null,null,0,null,null,null,null,null,null,null,null,null,null,null,null,null,null,null,null,null,null,null,null,null,null,null,null,null,null,null,null,null,null,null,null,null,null,null,null,null,null,null,null,null,null,null,null,null,null,null,null,null,null,null,null,null,null,null,null,null,null,null,null,null,null,null,null,null,null,null,null,null,null,null,null,null,null,null,null,null,null,null,null,null,null,null,null,null,null,null,null,null,null,null,null,null,null,null,null,null,null,null,null,null,null,null,null,null,null,null,null,null,null,null,null,null,null,null,null,null,null,null,null,null,null,null,null,null,null,null,"Good",0,0,"Good"]
[null,null,null,null,0,null,null,null,null,null,null,null,null,null,null,null,null,null,null,null,null,null,null,null,null,null,null,null,null,null,null,null,null,null,null,null,null,null,null,null,null,null,null,null,null,null,null,null,null,null,null,null,null,null,null,null,null,null,null,null,null,null,null,null,null,null,null,null,null,null,null,null,null,null,null,null,null,null,null,null,null,null,null,null,null,null,null,null,null,null,null,null,null,null,null,null,null,null,null,null,null,null,null,null,null,null,null,null,null,null,null,null,null,null,null,null,null,null,null,null,null,null,null,null,null,null,null,null,null,null,null,null,"Good",0,0,"Good"]
[null,null,null,null,0,null,null,null,null,null,null,null,null,null,null,null,null,null,null,null,null,null,null,null,null,null,null,null,null,null,null,null,null,null,null,null,null,null,null,null,null,null,null,null,null,null,null,null,null,null,null,null,null,null,null,null,null,null,null,null,null,null,null,null,null,null,null,null,null,null,null,null,null,null,null,null,null,null,null,null,null,null,null,null,null,null,null,null,null,null,null,null,null,null,null,null,null,null,null,null,null,null,null,null,null,null,null,null,null,null,null,null,null,null,null,null,null,null,null,null,null,null,null,null,null,null,null,null,null,null,null,null,"Good",0,0,"Good"]
[null,null,null,null,0,null,null,null,null,null,null,null,null,null,null,null,null,null,null,null,null,null,null,null,null,null,null,null,null,null,null,null,null,null,null,null,null,null,null,null,null,null,null,null,null,null,null,null,null,null,null,null,null,null,null,null,null,null,null,null,null,null,null,null,null,null,null,null,null,null,null,null,null,null,null,null,null,null,null,null,null,null,null,null,null,null,null,null,null,null,null,null,null,null,null,null,null,null,null,null,null,null,null,null,null,null,null,null,null,null,null,null,null,null,null,null,null,null,null,null,null,null,null,null,null,null,null,null,null,null,null,null,{"$f":"IF(ED21=1,\"Error\",\"Good\")","v":"Good"},0,0,{"$f":"IF(EE21=1,\"Error\",\"Good\")","v":"Good"}]
[null,null,null,null,0,null,null,null,null,null,null,null,null,null,null,null,null,null,null,null,null,null,null,null,null,null,null,null,null,null,null,null,null,null,null,null,null,null,null,null,null,null,null,null,null,null,null,null,null,null,null,null,null,null,null,null,null,null,null,null,null,null,null,null,null,null,null,null,null,null,null,null,null,null,null,null,null,null,null,null,null,null,null,null,null,null,null,null,null,null,null,null,null,null,null,null,null,null,null,null,null,null,null,null,null,null,null,null,null,null,null,null,null,null,null,null,null,null,null,null,null,null,null,null,null,null,null,null,null,null,null,null,"Good",0,0,"Good"]
[null,null,null,null,0,null,null,null,null,null,null,null,null,null,null,null,null,null,null,null,null,null,null,null,null,null,null,null,null,null,null,null,null,null,null,null,null,null,null,null,null,null,null,null,null,null,null,null,null,null,null,null,null,null,null,null,null,null,null,null,null,null,null,null,null,null,null,null,null,null,null,null,null,null,null,null,null,null,null,null,null,null,null,null,null,null,null,null,null,null,null,null,null,null,null,null,null,null,null,null,null,null,null,null,null,null,null,null,null,null,null,null,null,null,null,null,null,null,null,null,null,null,null,null,null,null,null,null,null,null,null,null,"Good",0,0,"Good"]
[null,null,null,null,0,null,null,null,null,null,null,null,null,null,null,null,null,null,null,null,null,null,null,null,null,null,null,null,null,null,null,null,null,null,null,null,null,null,null,null,null,null,null,null,null,null,null,null,null,null,null,null,null,null,null,null,null,null,null,null,null,null,null,null,null,null,null,null,null,null,null,null,null,null,null,null,null,null,null,null,null,null,null,null,null,null,null,null,null,null,null,null,null,null,null,null,null,null,null,null,null,null,null,null,null,null,null,null,null,null,null,null,null,null,null,null,null,null,null,null,null,null,null,null,null,null,null,null,null,null,null,null,"Good",0,0,"Good"]
[null,null,null,null,0,null,null,null,null,null,null,null,null,null,null,null,null,null,null,null,null,null,null,null,null,null,null,null,null,null,null,null,null,null,null,null,null,null,null,null,null,null,null,null,null,null,null,null,null,null,null,null,null,null,null,null,null,null,null,null,null,null,null,null,null,null,null,null,null,null,null,null,null,null,null,null,null,null,null,null,null,null,null,null,null,null,null,null,null,null,null,null,null,null,null,null,null,null,null,null,null,null,null,null,null,null,null,null,null,null,null,null,null,null,null,null,null,null,null,null,null,null,null,null,null,null,null,null,null,null,null,null,{"$f":"IF(ED25=1,\"Error\",\"Good\")","v":"Good"},0,0,{"$f":"IF(EE25=1,\"Error\",\"Good\")","v":"Good"}]
[null,null,null,null,0,null,null,null,null,null,null,null,null,null,null,null,null,null,null,null,null,null,null,null,null,null,null,null,null,null,null,null,null,null,null,null,null,null,null,null,null,null,null,null,null,null,null,null,null,null,null,null,null,null,null,null,null,null,null,null,null,null,null,null,null,null,null,null,null,null,null,null,null,null,null,null,null,null,null,null,null,null,null,null,null,null,null,null,null,null,null,null,null,null,null,null,null,null,null,null,null,null,null,null,null,null,null,null,null,null,null,null,null,null,null,null,null,null,null,null,null,null,null,null,null,null,null,null,null,null,null,null,{"$f":"IF(ED26=1,\"Error\",\"Good\")","v":"Good"},0,0,{"$f":"IF(EE26=1,\"Error\",\"Good\")","v":"Good"}]
[null,null,null,null,0,null,null,null,null,null,null,null,null,null,null,null,null,null,null,null,null,null,null,null,null,null,null,null,null,null,null,null,null,null,null,null,null,null,null,null,null,null,null,null,null,null,null,null,null,null,null,null,null,null,null,null,null,null,null,null,null,null,null,null,null,null,null,null,null,null,null,null,null,null,null,null,null,null,null,null,null,null,null,null,null,null,null,null,null,null,null,null,null,null,null,null,null,null,null,null,null,null,null,null,null,null,null,null,null,null,null,null,null,null,null,null,null,null,null,null,null,null,null,null,null,null,null,null,null,null,null,null,"Good",0,0,"Good"]
[null,null,null,null,0,null,null,null,null,null,null,null,null,null,null,null,null,null,null,null,null,null,null,null,null,null,null,null,null,null,null,null,null,null,null,null,null,null,null,null,null,null,null,null,null,null,null,null,null,null,null,null,null,null,null,null,null,null,null,null,null,null,null,null,null,null,null,null,null,null,null,null,null,null,null,null,null,null,null,null,null,null,null,null,null,null,null,null,null,null,null,null,null,null,null,null,null,null,null,null,null,null,null,null,null,null,null,null,null,null,null,null,null,null,null,null,null,null,null,null,null,null,null,null,null,null,null,null,null,null,null,null,"Good",0,0,"Good"]
[null,null,null,null,0,null,null,null,null,null,null,null,null,null,null,null,null,null,null,null,null,null,null,null,null,null,null,null,null,null,null,null,null,null,null,null,null,null,null,null,null,null,null,null,null,null,null,null,null,null,null,null,null,null,null,null,null,null,null,null,null,null,null,null,null,null,null,null,null,null,null,null,null,null,null,null,null,null,null,null,null,null,null,null,null,null,null,null,null,null,null,null,null,null,null,null,null,null,null,null,null,null,null,null,null,null,null,null,null,null,null,null,null,null,null,null,null,null,null,null,null,null,null,null,null,null,null,null,null,null,null,null,{"$f":"IF(ED29=1,\"Error\",\"Good\")","v":"Good"},0,0,{"$f":"IF(EE29=1,\"Error\",\"Good\")","v":"Good"}]
[null,null,null,null,0,null,null,null,null,null,null,null,null,null,null,null,null,null,null,null,null,null,null,null,null,null,null,null,null,null,null,null,null,null,null,null,null,null,null,null,null,null,null,null,null,null,null,null,null,null,null,null,null,null,null,null,null,null,null,null,null,null,null,null,null,null,null,null,null,null,null,null,null,null,null,null,null,null,null,null,null,null,null,null,null,null,null,null,null,null,null,null,null,null,null,null,null,null,null,null,null,null,null,null,null,null,null,null,null,null,null,null,null,null,null,null,null,null,null,null,null,null,null,null,null,null,null,null,null,null,null,null,"Good",0,0,"Good"]
[null,null,null,null,0,null,null,null,null,null,null,null,null,null,null,null,null,null,null,null,null,null,null,null,null,null,null,null,null,null,null,null,null,null,null,null,null,null,null,null,null,null,null,null,null,null,null,null,null,null,null,null,null,null,null,null,null,null,null,null,null,null,null,null,null,null,null,null,null,null,null,null,null,null,null,null,null,null,null,null,null,null,null,null,null,null,null,null,null,null,null,null,null,null,null,null,null,null,null,null,null,null,null,null,null,null,null,null,null,null,null,null,null,null,null,null,null,null,null,null,null,null,null,null,null,null,null,null,null,null,null,null,{"$f":"IF(ED31=1,\"Error\",\"Good\")","v":"Good"},0,0,{"$f":"IF(EE31=1,\"Error\",\"Good\")","v":"Good"}]
[null,null,null,null,0,null,null,null,null,null,null,null,null,null,null,null,null,null,null,null,null,null,null,null,null,null,null,null,null,null,null,null,null,null,null,null,null,null,null,null,null,null,null,null,null,null,null,null,null,null,null,null,null,null,null,null,null,null,null,null,null,null,null,null,null,null,null,null,null,null,null,null,null,null,null,null,null,null,null,null,null,null,null,null,null,null,null,null,null,null,null,null,null,null,null,null,null,null,null,null,null,null,null,null,null,null,null,null,null,null,null,null,null,null,null,null,null,null,null,null,null,null,null,null,null,null,null,null,null,null,null,null,"Good",0,0,"Good"]
[null,null,null,null,0,null,null,null,null,null,null,null,null,null,null,null,null,null,null,null,null,null,null,null,null,null,null,null,null,null,null,null,null,null,null,null,null,null,null,null,null,null,null,null,null,null,null,null,null,null,null,null,null,null,null,null,null,null,null,null,null,null,null,null,null,null,null,null,null,null,null,null,null,null,null,null,null,null,null,null,null,null,null,null,null,null,null,null,null,null,null,null,null,null,null,null,null,null,null,null,null,null,null,null,null,null,null,null,null,null,null,null,null,null,null,null,null,null,null,null,null,null,null,null,null,null,null,null,null,null,null,null,"Good",0,0,"Good"]
[null,null,null,null,0,null,null,null,null,null,null,null,null,null,null,null,null,null,null,null,null,null,null,null,null,null,null,null,null,null,null,null,null,null,null,null,null,null,null,null,null,null,null,null,null,null,null,null,null,null,null,null,null,null,null,null,null,null,null,null,null,null,null,null,null,null,null,null,null,null,null,null,null,null,null,null,null,null,null,null,null,null,null,null,null,null,null,null,null,null,null,null,null,null,null,null,null,null,null,null,null,null,null,null,null,null,null,null,null,null,null,null,null,null,null,null,null,null,null,null,null,null,null,null,null,null,null,null,null,null,null,null,"Good",0,0,"Good"]
[null,null,null,null,0,null,null,null,null,null,null,null,null,null,null,null,null,null,null,null,null,null,null,null,null,null,null,null,null,null,null,null,null,null,null,null,null,null,null,null,null,null,null,null,null,null,null,null,null,null,null,null,null,null,null,null,null,null,null,null,null,null,null,null,null,null,null,null,null,null,null,null,null,null,null,null,null,null,null,null,null,null,null,null,null,null,null,null,null,null,null,null,null,null,null,null,null,null,null,null,null,null,null,null,null,null,null,null,null,null,null,null,null,null,null,null,null,null,null,null,null,null,null,null,null,null,null,null,null,null,null,null,"Good",0,0,"Good"]
[null,null,null,null,null,{"$f":"F3-SUM(F5:F35)","v":8},8,8,8,8,8,8,8,8,8,8,8,8,8,8,8,8,8,8,8,8,8,8,8,{"$f":"AD3-SUM(AD5:AD35)","v":8},{"$f":"AE3-SUM(AE5:AE35)","v":8},8,8,8,8,8,8,{"$f":"AL3-SUM(AL5:AL35)","v":8},8,8,8,8,8,8,8,8,8,8,8,8,8,8,8,8,8,8,8,8,8,8,8,8,8,8,3,8,8,8,8,8,{"$f":"BS3-SUM(BS5:BS35)","v":8},8,8,8,8,8,8,8,8,8,8,8,8,8,8,8,8,8,8,8,8,3,8,8,8,8,8,8,8,3,8,8,{"$f":"CY3-SUM(CY5:CY35)","v":8},8,8,8,8,8,8,8,8,8,8,8,8,8,8,8,{"$f":"DO3-SUM(DO5:DO35)","v":8},8,{"$f":"DQ3-SUM(DQ5:DQ35)","v":8},8,{"$f":"DS3-SUM(DS5:DS35)","v":8},8,8,8,8,8,8,8,8,8,null,null,{"$f":"Tabelle1!BR12","v":0}]
[null,null,null,null,null,{"$f":"IF(F36=0,\"Y\",\"N\")","v":"N"},{"$f":"IF(G36=0,\"Y\",\"N\")","v":"N"},"N","N","N","N","N",{"$f":"IF(M36=0,\"Y\",\"N\")","v":"N"},{"$f":"IF(N36=0,\"Y\",\"N\")","v":"N"},{"$f":"IF(O36=0,\"Y\",\"N\")","v":"N"},{"$f":"IF(P36=0,\"Y\",\"N\")","v":"N"},{"$f":"IF(Q36=0,\"Y\",\"N\")","v":"N"},{"$f":"IF(R36=0,\"Y\",\"N\")","v":"N"},"N","N","N","N","N","N","N","N","N","N","N","N","N","N","N","N","N","N","N","N","N","N","N","N","N","N","N","N","N","N","N","N","N","N","N","N","N","N","N","N","N","N","N","N","N","N","N","N","N","N","N","N","N","N","N","N","N","N","N","N","N","N","N","N",{"$f":"IF(CE36=0,\"Y\",\"N\")","v":"N"},"N","N","N","N","N","N","N","N","N",{"$f":"IF(CO36=0,\"Y\",\"N\")","v":"N"},"N","N","N","N","N","N","N","N","N","N","N","N","N","N","N","N","N","N",{"$f":"IF(DH36=0,\"Y\",\"N\")","v":"N"},"N","N","N","N","N","N",{"$f":"IF(DO36=0,\"Y\",\"N\")","v":"N"},"N","N","N",{"$f":"IF(DS36=0,\"Y\",\"N\")","v":"N"},"N","N","N","N","N","N","N","N","N"]

{"sheet":"Sheet2","index":1,"n_rows":2,"n_cols":121,"rows_kept":2,"cut":false,"hidden":false,"merged":[]}
[6,6,7,10,11,11,11,13,15,15,15,15,15,17,21,21,21,22,22,25,26,26,29,30,30,31,33,33,36,38,40,41,45,46,46,47,47,47,47,47,47,48,50,54,56,56,56,57,60,61,61,62,62,65,68,67,67,67,67,67,67,67,68,70,70,72,72,75,75,75,77,77,77,79,79,79,82,82,83,86,88,90,90,90,90,90,90,90,93,95,98,98,99,101,101,102,104,105,105,106,108,109,111,113,113,114,114,114,116,119,121,123,123,123,123,124,126,128,130,130,131]
[7,8,8,11,12,13,14,14,16,17,18,19,20,18,22,23,24,23,24,26,27,28,30,31,32,32,34,35,37,39,41,42,46,47,48,48,49,50,51,52,53,49,51,55,57,58,59,58,61,62,63,63,64,66,70,68,69,70,71,72,73,74,69,71,72,73,74,76,77,78,78,79,80,80,81,82,83,84,84,87,89,91,92,93,94,95,96,97,94,96,99,100,100,102,103,103,105,106,107,107,109,110,112,114,115,115,116,117,117,120,122,124,125,126,127,125,127,129,131,132,132]

{"sheet":"Tabelle1","index":2,"n_rows":35,"n_cols":70,"rows_kept":35,"cut":false,"hidden":false,"merged":[]}
[]
[]
[]
[]
[{"$f":"Sheet1!F5+Sheet1!G5+Sheet1!H5","v":0},{"$f":"Sheet1!J5+Sheet1!K5","v":0},{"$f":"Sheet1!K5+Sheet1!L5","v":0},{"$f":"Sheet1!K5+Sheet1!M5+Sheet1!N5","v":0},{"$f":"Sheet1!O5+Sheet1!P5","v":0},{"$f":"Sheet1!O5+Sheet1!Q5+Sheet1!R5","v":0},{"$f":"Sheet1!O5+Sheet1!S5","v":0},{"$f":"Sheet1!O5+Sheet1!T5","v":0},{"$f":"Sheet1!Q5+Sheet1!R5","v":0},{"$f":"Sheet1!U5+Sheet1!V5+Sheet1!W5","v":0},{"$f":"Sheet1!U5+Sheet1!V5+Sheet1!X5","v":0},{"$f":"Sheet1!Y5+Sheet1!Z5","v":0},{"$f":"Sheet1!Z5+Sheet1!AA5","v":0},{"$f":"Sheet1!Z5+Sheet1!AB5","v":0},{"$f":"Sheet1!AC5+Sheet1!AD5","v":0},{"$f":"Sheet1!AD5+Sheet1!AE5+Sheet1!AF5","v":0},{"$f":"Sheet1!AG5+Sheet1!AH5","v":0},{"$f":"Sheet1!AG5+Sheet1!AI5","v":0},{"$f":"Sheet1!AJ5+Sheet1!AK5","v":0},{"$f":"Sheet1!AL5+Sheet1!AM5","v":0},{"$f":"Sheet1!AO5+Sheet1!AN5","v":0},{"$f":"Sheet1!AO5+Sheet1!AP5","v":0},{"$f":"Sheet1!AT5+Sheet1!AS5","v":0},{"$f":"Sheet1!AU5+Sheet1!AT5+Sheet1!AV5","v":0},{"$f":"Sheet1!AU5+Sheet1!AV5+Sheet1!AW5","v":0},{"$f":"Sheet1!AU5+Sheet1!AX5+Sheet1!AY5","v":0},{"$f":"Sheet1!AU5+Sheet1!AZ5","v":0},{"$f":"Sheet1!AU5+Sheet1!BA5","v":0},{"$f":"Sheet1!BB5+Sheet1!BC5","v":0},{"$f":"Sheet1!BD5+Sheet1!BE5+Sheet1!BF5","v":0},{"$f":"Sheet1!BD5+Sheet1!BG5","v":0},{"$f":"Sheet1!BH5+Sheet1!BI5","v":0},{"$f":"Sheet1!BI5+Sheet1!BJ5+Sheet1!BK5","v":0},{"$f":"Sheet1!BJ5+Sheet1!BL5","v":0},{"$f":"Sheet1!BM5+Sheet1!BN5","v":0},{"$f":"Sheet1!BO5+Sheet1!BP5+Sheet1!BQ5","v":0},{"$f":"Sheet1!BO5+Sheet1!BR5+Sheet1!BS5","v":0},{"$f":"Sheet1!BO5+Sheet1!BR5+Sheet1!BT5","v":0},{"$f":"Sheet1!BO5+Sheet1!BU5+Sheet1!BT5","v":0},{"$f":"Sheet1!BO5+Sheet1!BT5+Sheet1!BV5","v":0},{"$f":"Sheet1!BW5+Sheet1!BX5","v":0},{"$f":"Sheet1!BW5+Sheet1!BY5+Sheet1!BZ5","v":0},{"$f":"Sheet1!BY5+Sheet1!CA5+Sheet1!CB5","v":0},{"$f":"Sheet1!CA5+Sheet1!CC5","v":0},{"$f":"Sheet1!CA5+Sheet1!CD5","v":0},{"$f":"Sheet1!CD5+Sheet1!CE5+Sheet1!CF5","v":0},{"$f":"Sheet1!CH5+Sheet1!CI5","v":0},{"$f":"Sheet1!CJ5+Sheet1!CK5","v":0},{"$f":"Sheet1!CL5+Sheet1!CM5","v":0},{"$f":"Sheet1!CL5+Sheet1!CN5","v":0},{"$f":"Sheet1!CL5+Sheet1!CO5+Sheet1!CP5","v":0},{"$f":"Sheet1!CL5+Sheet1!CQ5+Sheet1!CR5","v":0},{"$f":"Sheet1!CL5+Sheet1!CS5","v":0},{"$f":"Sheet1!CT5+Sheet1!CU5+Sheet1!CV5","v":0},{"$f":"Sheet1!CW5+Sheet1!CX5+Sheet1!CY5","v":0},{"$f":"Sheet1!CZ5+Sheet1!DA5","v":0},{"$f":"Sheet1!DA5+Sheet1!DB5+Sheet1!DC5","v":0},{"$f":"Sheet1!DD5+Sheet1!DE5","v":0},{"$f":"Sheet1!DE5+Sheet1!DF5","v":0},{"$f":"Sheet1!DG5+Sheet1!DH5","v":0},{"$f":"Sheet1!DJ5+Sheet1!DI5+Sheet1!DK5","v":0},{"$f":"Sheet1!DJ5+Sheet1!DL5+Sheet1!DM5","v":0},{"$f":"Sheet1!DO5+Sheet1!DP5","v":0},{"$f":"Sheet1!DQ5+Sheet1!DR5","v":0},{"$f":"Sheet1!DS5+Sheet1!DT5+Sheet1!DU5","v":0},{"$f":"Sheet1!DS5+Sheet1!DV5+Sheet1!DW5","v":0},{"$f":"Sheet1!DX5+Sheet1!DY5","v":0},{"$f":"Sheet1!DZ5+Sheet1!EA5+Sheet1!EB5","v":0},null,2]
[{"$f":"Sheet1!F6+Sheet1!G6+Sheet1!H6","v":0},{"$f":"Sheet1!J6+Sheet1!K6","v":0},{"$f":"Sheet1!K6+Sheet1!L6","v":0},{"$f":"Sheet1!K6+Sheet1!M6+Sheet1!N6","v":0},{"$f":"Sheet1!O6+Sheet1!P6","v":0},{"$f":"Sheet1!O6+Sheet1!Q6+Sheet1!R6","v":0},{"$f":"Sheet1!O6+Sheet1!S6","v":0},{"$f":"Sheet1!O6+Sheet1!T6","v":0},{"$f":"Sheet1!Q6+Sheet1!R6","v":0},{"$f":"Sheet1!U6+Sheet1!V6+Sheet1!W6","v":0},{"$f":"Sheet1!U6+Sheet1!V6+Sheet1!X6","v":0},{"$f":"Sheet1!Y6+Sheet1!Z6","v":0},{"$f":"Sheet1!Z6+Sheet1!AA6","v":0},{"$f":"Sheet1!Z6+Sheet1!AB6","v":0},{"$f":"Sheet1!AC6+Sheet1!AD6","v":0},{"$f":"Sheet1!AD6+Sheet1!AE6+Sheet1!AF6","v":0},{"$f":"Sheet1!AG6+Sheet1!AH6","v":0},{"$f":"Sheet1!AG6+Sheet1!AI6","v":0},{"$f":"Sheet1!AJ6+Sheet1!AK6","v":0},{"$f":"Sheet1!AL6+Sheet1!AM6","v":0},{"$f":"Sheet1!AO6+Sheet1!AN6","v":0},{"$f":"Sheet1!AO6+Sheet1!AP6","v":0},{"$f":"Sheet1!AT6+Sheet1!AS6","v":0},{"$f":"Sheet1!AU6+Sheet1!AT6+Sheet1!AV6","v":0},{"$f":"Sheet1!AU6+Sheet1!AV6+Sheet1!AW6","v":0},{"$f":"Sheet1!AU6+Sheet1!AX6+Sheet1!AY6","v":0},{"$f":"Sheet1!AU6+Sheet1!AZ6","v":0},{"$f":"Sheet1!AU6+Sheet1!BA6","v":0},{"$f":"Sheet1!BB6+Sheet1!BC6","v":0},{"$f":"Sheet1!BD6+Sheet1!BE6+Sheet1!BF6","v":0},{"$f":"Sheet1!BD6+Sheet1!BG6","v":0},{"$f":"Sheet1!BH6+Sheet1!BI6","v":0},{"$f":"Sheet1!BI6+Sheet1!BJ6+Sheet1!BK6","v":0},{"$f":"Sheet1!BJ6+Sheet1!BL6","v":0},{"$f":"Sheet1!BM6+Sheet1!BN6","v":0},{"$f":"Sheet1!BO6+Sheet1!BP6+Sheet1!BQ6","v":0},{"$f":"Sheet1!BO6+Sheet1!BR6+Sheet1!BS6","v":0},{"$f":"Sheet1!BO6+Sheet1!BR6+Sheet1!BT6","v":0},{"$f":"Sheet1!BO6+Sheet1!BU6+Sheet1!BT6","v":0},{"$f":"Sheet1!BO6+Sheet1!BT6+Sheet1!BV6","v":0},{"$f":"Sheet1!BW6+Sheet1!BX6","v":0},{"$f":"Sheet1!BW6+Sheet1!BY6+Sheet1!BZ6","v":0},{"$f":"Sheet1!BY6+Sheet1!CA6+Sheet1!CB6","v":0},{"$f":"Sheet1!CA6+Sheet1!CC6","v":0},{"$f":"Sheet1!CA6+Sheet1!CD6","v":0},{"$f":"Sheet1!CD6+Sheet1!CE6+Sheet1!CF6","v":0},{"$f":"Sheet1!CH6+Sheet1!CI6","v":0},{"$f":"Sheet1!CJ6+Sheet1!CK6","v":0},{"$f":"Sheet1!CL6+Sheet1!CM6","v":0},{"$f":"Sheet1!CL6+Sheet1!CN6","v":0},{"$f":"Sheet1!CL6+Sheet1!CO6+Sheet1!CP6","v":0},{"$f":"Sheet1!CL6+Sheet1!CQ6+Sheet1!CR6","v":0},{"$f":"Sheet1!CL6+Sheet1!CS6","v":0},{"$f":"Sheet1!CT6+Sheet1!CU6+Sheet1!CV6","v":0},{"$f":"Sheet1!CW6+Sheet1!CX6+Sheet1!CY6","v":0},{"$f":"Sheet1!CZ6+Sheet1!DA6","v":0},{"$f":"Sheet1!DA6+Sheet1!DB6+Sheet1!DC6","v":0},{"$f":"Sheet1!DD6+Sheet1!DE6","v":0},{"$f":"Sheet1!DE6+Sheet1!DF6","v":0},{"$f":"Sheet1!DG6+Sheet1!DH6","v":0},{"$f":"Sheet1!DJ6+Sheet1!DI6+Sheet1!DK6","v":0},{"$f":"Sheet1!DJ6+Sheet1!DL6+Sheet1!DM6","v":0},{"$f":"Sheet1!DO6+Sheet1!DP6","v":0},{"$f":"Sheet1!DQ6+Sheet1!DR6","v":0},{"$f":"Sheet1!DS6+Sheet1!DT6+Sheet1!DU6","v":0},{"$f":"Sheet1!DS6+Sheet1!DV6+Sheet1!DW6","v":0},{"$f":"Sheet1!DX6+Sheet1!DY6","v":0},{"$f":"Sheet1!DZ6+Sheet1!EA6+Sheet1!EB6","v":0},null,{"$f":"COUNTIF($A5:$BP35,BR5)","v":0}]
[{"$f":"Sheet1!F7+Sheet1!G7+Sheet1!H7","v":0},{"$f":"Sheet1!J7+Sheet1!K7","v":0},{"$f":"Sheet1!K7+Sheet1!L7","v":0},{"$f":"Sheet1!K7+Sheet1!M7+Sheet1!N7","v":0},{"$f":"Sheet1!O7+Sheet1!P7","v":0},{"$f":"Sheet1!O7+Sheet1!Q7+Sheet1!R7","v":0},{"$f":"Sheet1!O7+Sheet1!S7","v":0},{"$f":"Sheet1!O7+Sheet1!T7","v":0},{"$f":"Sheet1!Q7+Sheet1!R7","v":0},{"$f":"Sheet1!U7+Sheet1!V7+Sheet1!W7","v":0},{"$f":"Sheet1!U7+Sheet1!V7+Sheet1!X7","v":0},{"$f":"Sheet1!Y7+Sheet1!Z7","v":0},{"$f":"Sheet1!Z7+Sheet1!AA7","v":0},{"$f":"Sheet1!Z7+Sheet1!AB7","v":0},{"$f":"Sheet1!AC7+Sheet1!AD7","v":0},{"$f":"Sheet1!AD7+Sheet1!AE7+Sheet1!AF7","v":0},{"$f":"Sheet1!AG7+Sheet1!AH7","v":0},{"$f":"Sheet1!AG7+Sheet1!AI7","v":0},{"$f":"Sheet1!AJ7+Sheet1!AK7","v":0},{"$f":"Sheet1!AL7+Sheet1!AM7","v":0},{"$f":"Sheet1!AO7+Sheet1!AN7","v":0},{"$f":"Sheet1!AO7+Sheet1!AP7","v":0},{"$f":"Sheet1!AT7+Sheet1!AS7","v":0},{"$f":"Sheet1!AU7+Sheet1!AT7+Sheet1!AV7","v":0},{"$f":"Sheet1!AU7+Sheet1!AV7+Sheet1!AW7","v":0},{"$f":"Sheet1!AU7+Sheet1!AX7+Sheet1!AY7","v":0},{"$f":"Sheet1!AU7+Sheet1!AZ7","v":0},{"$f":"Sheet1!AU7+Sheet1!BA7","v":0},{"$f":"Sheet1!BB7+Sheet1!BC7","v":0},{"$f":"Sheet1!BD7+Sheet1!BE7+Sheet1!BF7","v":0},{"$f":"Sheet1!BD7+Sheet1!BG7","v":0},{"$f":"Sheet1!BH7+Sheet1!BI7","v":0},{"$f":"Sheet1!BI7+Sheet1!BJ7+Sheet1!BK7","v":0},{"$f":"Sheet1!BJ7+Sheet1!BL7","v":0},{"$f":"Sheet1!BM7+Sheet1!BN7","v":0},{"$f":"Sheet1!BO7+Sheet1!BP7+Sheet1!BQ7","v":0},{"$f":"Sheet1!BO7+Sheet1!BR7+Sheet1!BS7","v":0},{"$f":"Sheet1!BO7+Sheet1!BR7+Sheet1!BT7","v":0},{"$f":"Sheet1!BO7+Sheet1!BU7+Sheet1!BT7","v":0},{"$f":"Sheet1!BO7+Sheet1!BT7+Sheet1!BV7","v":0},{"$f":"Sheet1!BW7+Sheet1!BX7","v":0},{"$f":"Sheet1!BW7+Sheet1!BY7+Sheet1!BZ7","v":0},{"$f":"Sheet1!BY7+Sheet1!CA7+Sheet1!CB7","v":0},{"$f":"Sheet1!CA7+Sheet1!CC7","v":0},{"$f":"Sheet1!CA7+Sheet1!CD7","v":0},{"$f":"Sheet1!CD7+Sheet1!CE7+Sheet1!CF7","v":0},{"$f":"Sheet1!CH7+Sheet1!CI7","v":0},{"$f":"Sheet1!CJ7+Sheet1!CK7","v":0},{"$f":"Sheet1!CL7+Sheet1!CM7","v":0},{"$f":"Sheet1!CL7+Sheet1!CN7","v":0},{"$f":"Sheet1!CL7+Sheet1!CO7+Sheet1!CP7","v":0},{"$f":"Sheet1!CL7+Sheet1!CQ7+Sheet1!CR7","v":0},{"$f":"Sheet1!CL7+Sheet1!CS7","v":0},{"$f":"Sheet1!CT7+Sheet1!CU7+Sheet1!CV7","v":0},{"$f":"Sheet1!CW7+Sheet1!CX7+Sheet1!CY7","v":0},{"$f":"Sheet1!CZ7+Sheet1!DA7","v":0},{"$f":"Sheet1!DA7+Sheet1!DB7+Sheet1!DC7","v":0},{"$f":"Sheet1!DD7+Sheet1!DE7","v":0},{"$f":"Sheet1!DE7+Sheet1!DF7","v":0},{"$f":"Sheet1!DG7+Sheet1!DH7","v":0},{"$f":"Sheet1!DJ7+Sheet1!DI7+Sheet1!DK7","v":0},{"$f":"Sheet1!DJ7+Sheet1!DL7+Sheet1!DM7","v":0},{"$f":"Sheet1!DO7+Sheet1!DP7","v":0},{"$f":"Sheet1!DQ7+Sheet1!DR7","v":0},{"$f":"Sheet1!DS7+Sheet1!DT7+Sheet1!DU7","v":0},{"$f":"Sheet1!DS7+Sheet1!DV7+Sheet1!DW7","v":0},{"$f":"Sheet1!DX7+Sheet1!DY7","v":0},{"$f":"Sheet1!DZ7+Sheet1!EA7+Sheet1!EB7","v":0},null,3]
[{"$f":"Sheet1!F8+Sheet1!G8+Sheet1!H8","v":0},{"$f":"Sheet1!J8+Sheet1!K8","v":0},{"$f":"Sheet1!K8+Sheet1!L8","v":0},{"$f":"Sheet1!K8+Sheet1!M8+Sheet1!N8","v":0},{"$f":"Sheet1!O8+Sheet1!P8","v":0},{"$f":"Sheet1!O8+Sheet1!Q8+Sheet1!R8","v":0},{"$f":"Sheet1!O8+Sheet1!S8","v":0},{"$f":"Sheet1!O8+Sheet1!T8","v":0},{"$f":"Sheet1!Q8+Sheet1!R8","v":0},{"$f":"Sheet1!U8+Sheet1!V8+Sheet1!W8","v":0},{"$f":"Sheet1!U8+Sheet1!V8+Sheet1!X8","v":0},{"$f":"Sheet1!Y8+Sheet1!Z8","v":0},{"$f":"Sheet1!Z8+Sheet1!AA8","v":0},{"$f":"Sheet1!Z8+Sheet1!AB8","v":0},{"$f":"Sheet1!AC8+Sheet1!AD8","v":0},{"$f":"Sheet1!AD8+Sheet1!AE8+Sheet1!AF8","v":0},{"$f":"Sheet1!AG8+Sheet1!AH8","v":0},{"$f":"Sheet1!AG8+Sheet1!AI8","v":0},{"$f":"Sheet1!AJ8+Sheet1!AK8","v":0},{"$f":"Sheet1!AL8+Sheet1!AM8","v":0},{"$f":"Sheet1!AO8+Sheet1!AN8","v":0},{"$f":"Sheet1!AO8+Sheet1!AP8","v":0},{"$f":"Sheet1!AT8+Sheet1!AS8","v":0},{"$f":"Sheet1!AU8+Sheet1!AT8+Sheet1!AV8","v":0},{"$f":"Sheet1!AU8+Sheet1!AV8+Sheet1!AW8","v":0},{"$f":"Sheet1!AU8+Sheet1!AX8+Sheet1!AY8","v":0},{"$f":"Sheet1!AU8+Sheet1!AZ8","v":0},{"$f":"Sheet1!AU8+Sheet1!BA8","v":0},{"$f":"Sheet1!BB8+Sheet1!BC8","v":0},{"$f":"Sheet1!BD8+Sheet1!BE8+Sheet1!BF8","v":0},{"$f":"Sheet1!BD8+Sheet1!BG8","v":0},{"$f":"Sheet1!BH8+Sheet1!BI8","v":0},{"$f":"Sheet1!BI8+Sheet1!BJ8+Sheet1!BK8","v":0},{"$f":"Sheet1!BJ8+Sheet1!BL8","v":0},{"$f":"Sheet1!BM8+Sheet1!BN8","v":0},{"$f":"Sheet1!BO8+Sheet1!BP8+Sheet1!BQ8","v":0},{"$f":"Sheet1!BO8+Sheet1!BR8+Sheet1!BS8","v":0},{"$f":"Sheet1!BO8+Sheet1!BR8+Sheet1!BT8","v":0},{"$f":"Sheet1!BO8+Sheet1!BU8+Sheet1!BT8","v":0},{"$f":"Sheet1!BO8+Sheet1!BT8+Sheet1!BV8","v":0},{"$f":"Sheet1!BW8+Sheet1!BX8","v":0},{"$f":"Sheet1!BW8+Sheet1!BY8+Sheet1!BZ8","v":0},{"$f":"Sheet1!BY8+Sheet1!CA8+Sheet1!CB8","v":0},{"$f":"Sheet1!CA8+Sheet1!CC8","v":0},{"$f":"Sheet1!CA8+Sheet1!CD8","v":0},{"$f":"Sheet1!CD8+Sheet1!CE8+Sheet1!CF8","v":0},{"$f":"Sheet1!CH8+Sheet1!CI8","v":0},{"$f":"Sheet1!CJ8+Sheet1!CK8","v":0},{"$f":"Sheet1!CL8+Sheet1!CM8","v":0},{"$f":"Sheet1!CL8+Sheet1!CN8","v":0},{"$f":"Sheet1!CL8+Sheet1!CO8+Sheet1!CP8","v":0},{"$f":"Sheet1!CL8+Sheet1!CQ8+Sheet1!CR8","v":0},{"$f":"Sheet1!CL8+Sheet1!CS8","v":0},{"$f":"Sheet1!CT8+Sheet1!CU8+Sheet1!CV8","v":0},{"$f":"Sheet1!CW8+Sheet1!CX8+Sheet1!CY8","v":0},{"$f":"Sheet1!CZ8+Sheet1!DA8","v":0},{"$f":"Sheet1!DA8+Sheet1!DB8+Sheet1!DC8","v":0},{"$f":"Sheet1!DD8+Sheet1!DE8","v":0},{"$f":"Sheet1!DE8+Sheet1!DF8","v":0},{"$f":"Sheet1!DG8+Sheet1!DH8","v":0},{"$f":"Sheet1!DJ8+Sheet1!DI8+Sheet1!DK8","v":0},{"$f":"Sheet1!DJ8+Sheet1!DL8+Sheet1!DM8","v":0},{"$f":"Sheet1!DO8+Sheet1!DP8","v":0},{"$f":"Sheet1!DQ8+Sheet1!DR8","v":0},{"$f":"Sheet1!DS8+Sheet1!DT8+Sheet1!DU8","v":0},{"$f":"Sheet1!DS8+Sheet1!DV8+Sheet1!DW8","v":0},{"$f":"Sheet1!DX8+Sheet1!DY8","v":0},{"$f":"Sheet1!DZ8+Sheet1!EA8+Sheet1!EB8","v":0},null,{"$f":"COUNTIF($A5:$BP35,BR7)","v":0}]
[{"$f":"Sheet1!F9+Sheet1!G9+Sheet1!H9","v":0},{"$f":"Sheet1!J9+Sheet1!K9","v":0},{"$f":"Sheet1!K9+Sheet1!L9","v":0},{"$f":"Sheet1!K9+Sheet1!M9+Sheet1!N9","v":0},{"$f":"Sheet1!O9+Sheet1!P9","v":0},{"$f":"Sheet1!O9+Sheet1!Q9+Sheet1!R9","v":0},{"$f":"Sheet1!O9+Sheet1!S9","v":0},{"$f":"Sheet1!O9+Sheet1!T9","v":0},{"$f":"Sheet1!Q9+Sheet1!R9","v":0},{"$f":"Sheet1!U9+Sheet1!V9+Sheet1!W9","v":0},{"$f":"Sheet1!U9+Sheet1!V9+Sheet1!X9","v":0},{"$f":"Sheet1!Y9+Sheet1!Z9","v":0},{"$f":"Sheet1!Z9+Sheet1!AA9","v":0},{"$f":"Sheet1!Z9+Sheet1!AB9","v":0},{"$f":"Sheet1!AC9+Sheet1!AD9","v":0},{"$f":"Sheet1!AD9+Sheet1!AE9+Sheet1!AF9","v":0},{"$f":"Sheet1!AG9+Sheet1!AH9","v":0},{"$f":"Sheet1!AG9+Sheet1!AI9","v":0},{"$f":"Sheet1!AJ9+Sheet1!AK9","v":0},{"$f":"Sheet1!AL9+Sheet1!AM9","v":0},{"$f":"Sheet1!AO9+Sheet1!AN9","v":0},{"$f":"Sheet1!AO9+Sheet1!AP9","v":0},{"$f":"Sheet1!AT9+Sheet1!AS9","v":0},{"$f":"Sheet1!AU9+Sheet1!AT9+Sheet1!AV9","v":0},{"$f":"Sheet1!AU9+Sheet1!AV9+Sheet1!AW9","v":0},{"$f":"Sheet1!AU9+Sheet1!AX9+Sheet1!AY9","v":0},{"$f":"Sheet1!AU9+Sheet1!AZ9","v":0},{"$f":"Sheet1!AU9+Sheet1!BA9","v":0},{"$f":"Sheet1!BB9+Sheet1!BC9","v":0},{"$f":"Sheet1!BD9+Sheet1!BE9+Sheet1!BF9","v":0},{"$f":"Sheet1!BD9+Sheet1!BG9","v":0},{"$f":"Sheet1!BH9+Sheet1!BI9","v":0},{"$f":"Sheet1!BI9+Sheet1!BJ9+Sheet1!BK9","v":0},{"$f":"Sheet1!BJ9+Sheet1!BL9","v":0},{"$f":"Sheet1!BM9+Sheet1!BN9","v":0},{"$f":"Sheet1!BO9+Sheet1!BP9+Sheet1!BQ9","v":0},{"$f":"Sheet1!BO9+Sheet1!BR9+Sheet1!BS9","v":0},{"$f":"Sheet1!BO9+Sheet1!BR9+Sheet1!BT9","v":0},{"$f":"Sheet1!BO9+Sheet1!BU9+Sheet1!BT9","v":0},{"$f":"Sheet1!BO9+Sheet1!BT9+Sheet1!BV9","v":0},{"$f":"Sheet1!BW9+Sheet1!BX9","v":0},{"$f":"Sheet1!BW9+Sheet1!BY9+Sheet1!BZ9","v":0},{"$f":"Sheet1!BY9+Sheet1!CA9+Sheet1!CB9","v":0},{"$f":"Sheet1!CA9+Sheet1!CC9","v":0},{"$f":"Sheet1!CA9+Sheet1!CD9","v":0},{"$f":"Sheet1!CD9+Sheet1!CE9+Sheet1!CF9","v":0},{"$f":"Sheet1!CH9+Sheet1!CI9","v":0},{"$f":"Sheet1!CJ9+Sheet1!CK9","v":0},{"$f":"Sheet1!CL9+Sheet1!CM9","v":0},{"$f":"Sheet1!CL9+Sheet1!CN9","v":0},{"$f":"Sheet1!CL9+Sheet1!CO9+Sheet1!CP9","v":0},{"$f":"Sheet1!CL9+Sheet1!CQ9+Sheet1!CR9","v":0},{"$f":"Sheet1!CL9+Sheet1!CS9","v":0},{"$f":"Sheet1!CT9+Sheet1!CU9+Sheet1!CV9","v":0},{"$f":"Sheet1!CW9+Sheet1!CX9+Sheet1!CY9","v":0},{"$f":"Sheet1!CZ9+Sheet1!DA9","v":0},{"$f":"Sheet1!DA9+Sheet1!DB9+Sheet1!DC9","v":0},{"$f":"Sheet1!DD9+Sheet1!DE9","v":0},{"$f":"Sheet1!DE9+Sheet1!DF9","v":0},{"$f":"Sheet1!DG9+Sheet1!DH9","v":0},{"$f":"Sheet1!DJ9+Sheet1!DI9+Sheet1!DK9","v":0},{"$f":"Sheet1!DJ9+Sheet1!DL9+Sheet1!DM9","v":0},{"$f":"Sheet1!DO9+Sheet1!DP9","v":0},{"$f":"Sheet1!DQ9+Sheet1!DR9","v":0},{"$f":"Sheet1!DS9+Sheet1!DT9+Sheet1!DU9","v":0},{"$f":"Sheet1!DS9+Sheet1!DV9+Sheet1!DW9","v":0},{"$f":"Sheet1!DX9+Sheet1!DY9","v":0},{"$f":"Sheet1!DZ9+Sheet1!EA9+Sheet1!EB9","v":0},null,4]
[{"$f":"Sheet1!F10+Sheet1!G10+Sheet1!H10","v":0},{"$f":"Sheet1!J10+Sheet1!K10","v":0},{"$f":"Sheet1!K10+Sheet1!L10","v":0},{"$f":"Sheet1!K10+Sheet1!M10+Sheet1!N10","v":0},{"$f":"Sheet1!O10+Sheet1!P10","v":0},{"$f":"Sheet1!O10+Sheet1!Q10+Sheet1!R10","v":0},{"$f":"Sheet1!O10+Sheet1!S10","v":0},{"$f":"Sheet1!O10+Sheet1!T10","v":0},{"$f":"Sheet1!Q10+Sheet1!R10","v":0},{"$f":"Sheet1!U10+Sheet1!V10+Sheet1!W10","v":0},{"$f":"Sheet1!U10+Sheet1!V10+Sheet1!X10","v":0},{"$f":"Sheet1!Y10+Sheet1!Z10","v":0},{"$f":"Sheet1!Z10+Sheet1!AA10","v":0},{"$f":"Sheet1!Z10+Sheet1!AB10","v":0},{"$f":"Sheet1!AC10+Sheet1!AD10","v":0},{"$f":"Sheet1!AD10+Sheet1!AE10+Sheet1!AF10","v":0},{"$f":"Sheet1!AG10+Sheet1!AH10","v":0},{"$f":"Sheet1!AG10+Sheet1!AI10","v":0},{"$f":"Sheet1!AJ10+Sheet1!AK10","v":0},{"$f":"Sheet1!AL10+Sheet1!AM10","v":0},{"$f":"Sheet1!AO10+Sheet1!AN10","v":0},{"$f":"Sheet1!AO10+Sheet1!AP10","v":0},{"$f":"Sheet1!AT10+Sheet1!AS10","v":0},{"$f":"Sheet1!AU10+Sheet1!AT10+Sheet1!AV10","v":0},{"$f":"Sheet1!AU10+Sheet1!AV10+Sheet1!AW10","v":0},{"$f":"Sheet1!AU10+Sheet1!AX10+Sheet1!AY10","v":0},{"$f":"Sheet1!AU10+Sheet1!AZ10","v":0},{"$f":"Sheet1!AU10+Sheet1!BA10","v":0},{"$f":"Sheet1!BB10+Sheet1!BC10","v":0},{"$f":"Sheet1!BD10+Sheet1!BE10+Sheet1!BF10","v":0},{"$f":"Sheet1!BD10+Sheet1!BG10","v":0},{"$f":"Sheet1!BH10+Sheet1!BI10","v":0},{"$f":"Sheet1!BI10+Sheet1!BJ10+Sheet1!BK10","v":0},{"$f":"Sheet1!BJ10+Sheet1!BL10","v":0},{"$f":"Sheet1!BM10+Sheet1!BN10","v":0},{"$f":"Sheet1!BO10+Sheet1!BP10+Sheet1!BQ10","v":0},{"$f":"Sheet1!BO10+Sheet1!BR10+Sheet1!BS10","v":0},{"$f":"Sheet1!BO10+Sheet1!BR10+Sheet1!BT10","v":0},{"$f":"Sheet1!BO10+Sheet1!BU10+Sheet1!BT10","v":0},{"$f":"Sheet1!BO10+Sheet1!BT10+Sheet1!BV10","v":0},{"$f":"Sheet1!BW10+Sheet1!BX10","v":0},{"$f":"Sheet1!BW10+Sheet1!BY10+Sheet1!BZ10","v":0},{"$f":"Sheet1!BY10+Sheet1!CA10+Sheet1!CB10","v":0},{"$f":"Sheet1!CA10+Sheet1!CC10","v":0},{"$f":"Sheet1!CA10+Sheet1!CD10","v":0},{"$f":"Sheet1!CD10+Sheet1!CE10+Sheet1!CF10","v":0},{"$f":"Sheet1!CH10+Sheet1!CI10","v":0},{"$f":"Sheet1!CJ10+Sheet1!CK10","v":0},{"$f":"Sheet1!CL10+Sheet1!CM10","v":0},{"$f":"Sheet1!CL10+Sheet1!CN10","v":0},{"$f":"Sheet1!CL10+Sheet1!CO10+Sheet1!CP10","v":0},{"$f":"Sheet1!CL10+Sheet1!CQ10+Sheet1!CR10","v":0},{"$f":"Sheet1!CL10+Sheet1!CS10","v":0},{"$f":"Sheet1!CT10+Sheet1!CU10+Sheet1!CV10","v":0},{"$f":"Sheet1!CW10+Sheet1!CX10+Sheet1!CY10","v":0},{"$f":"Sheet1!CZ10+Sheet1!DA10","v":0},{"$f":"Sheet1!DA10+Sheet1!DB10+Sheet1!DC10","v":0},{"$f":"Sheet1!DD10+Sheet1!DE10","v":0},{"$f":"Sheet1!DE10+Sheet1!DF10","v":0},{"$f":"Sheet1!DG10+Sheet1!DH10","v":0},{"$f":"Sheet1!DJ10+Sheet1!DI10+Sheet1!DK10","v":0},{"$f":"Sheet1!DJ10+Sheet1!DL10+Sheet1!DM10","v":0},{"$f":"Sheet1!DO10+Sheet1!DP10","v":0},{"$f":"Sheet1!DQ10+Sheet1!DR10","v":0},{"$f":"Sheet1!DS10+Sheet1!DT10+Sheet1!DU10","v":0},{"$f":"Sheet1!DS10+Sheet1!DV10+Sheet1!DW10","v":0},{"$f":"Sheet1!DX10+Sheet1!DY10","v":0},{"$f":"Sheet1!DZ10+Sheet1!EA10+Sheet1!EB10","v":0},null,{"$f":"COUNTIF($A5:$BP35,BR9)","v":0}]
[{"$f":"Sheet1!F11+Sheet1!G11+Sheet1!H11","v":0},{"$f":"Sheet1!J11+Sheet1!K11","v":0},{"$f":"Sheet1!K11+Sheet1!L11","v":0},{"$f":"Sheet1!K11+Sheet1!M11+Sheet1!N11","v":0},{"$f":"Sheet1!O11+Sheet1!P11","v":0},{"$f":"Sheet1!O11+Sheet1!Q11+Sheet1!R11","v":0},{"$f":"Sheet1!O11+Sheet1!S11","v":0},{"$f":"Sheet1!O11+Sheet1!T11","v":0},{"$f":"Sheet1!Q11+Sheet1!R11","v":0},{"$f":"Sheet1!U11+Sheet1!V11+Sheet1!W11","v":0},{"$f":"Sheet1!U11+Sheet1!V11+Sheet1!X11","v":0},{"$f":"Sheet1!Y11+Sheet1!Z11","v":0},{"$f":"Sheet1!Z11+Sheet1!AA11","v":0},{"$f":"Sheet1!Z11+Sheet1!AB11","v":0},{"$f":"Sheet1!AC11+Sheet1!AD11","v":0},{"$f":"Sheet1!AD11+Sheet1!AE11+Sheet1!AF11","v":0},{"$f":"Sheet1!AG11+Sheet1!AH11","v":0},{"$f":"Sheet1!AG11+Sheet1!AI11","v":0},{"$f":"Sheet1!AJ11+Sheet1!AK11","v":0},{"$f":"Sheet1!AL11+Sheet1!AM11","v":0},{"$f":"Sheet1!AO11+Sheet1!AN11","v":0},{"$f":"Sheet1!AO11+Sheet1!AP11","v":0},{"$f":"Sheet1!AT11+Sheet1!AS11","v":0},{"$f":"Sheet1!AU11+Sheet1!AT11+Sheet1!AV11","v":0},{"$f":"Sheet1!AU11+Sheet1!AV11+Sheet1!AW11","v":0},{"$f":"Sheet1!AU11+Sheet1!AX11+Sheet1!AY11","v":0},{"$f":"Sheet1!AU11+Sheet1!AZ11","v":0},{"$f":"Sheet1!AU11+Sheet1!BA11","v":0},{"$f":"Sheet1!BB11+Sheet1!BC11","v":0},{"$f":"Sheet1!BD11+Sheet1!BE11+Sheet1!BF11","v":0},{"$f":"Sheet1!BD11+Sheet1!BG11","v":0},{"$f":"Sheet1!BH11+Sheet1!BI11","v":0},{"$f":"Sheet1!BI11+Sheet1!BJ11+Sheet1!BK11","v":0},{"$f":"Sheet1!BJ11+Sheet1!BL11","v":0},{"$f":"Sheet1!BM11+Sheet1!BN11","v":0},{"$f":"Sheet1!BO11+Sheet1!BP11+Sheet1!BQ11","v":0},{"$f":"Sheet1!BO11+Sheet1!BR11+Sheet1!BS11","v":0},{"$f":"Sheet1!BO11+Sheet1!BR11+Sheet1!BT11","v":0},{"$f":"Sheet1!BO11+Sheet1!BU11+Sheet1!BT11","v":0},{"$f":"Sheet1!BO11+Sheet1!BT11+Sheet1!BV11","v":0},{"$f":"Sheet1!BW11+Sheet1!BX11","v":0},{"$f":"Sheet1!BW11+Sheet1!BY11+Sheet1!BZ11","v":0},{"$f":"Sheet1!BY11+Sheet1!CA11+Sheet1!CB11","v":0},{"$f":"Sheet1!CA11+Sheet1!CC11","v":0},{"$f":"Sheet1!CA11+Sheet1!CD11","v":0},{"$f":"Sheet1!CD11+Sheet1!CE11+Sheet1!CF11","v":0},{"$f":"Sheet1!CH11+Sheet1!CI11","v":0},{"$f":"Sheet1!CJ11+Sheet1!CK11","v":0},{"$f":"Sheet1!CL11+Sheet1!CM11","v":0},{"$f":"Sheet1!CL11+Sheet1!CN11","v":0},{"$f":"Sheet1!CL11+Sheet1!CO11+Sheet1!CP11","v":0},{"$f":"Sheet1!CL11+Sheet1!CQ11+Sheet1!CR11","v":0},{"$f":"Sheet1!CL11+Sheet1!CS11","v":0},{"$f":"Sheet1!CT11+Sheet1!CU11+Sheet1!CV11","v":0},{"$f":"Sheet1!CW11+Sheet1!CX11+Sheet1!CY11","v":0},{"$f":"Sheet1!CZ11+Sheet1!DA11","v":0},{"$f":"Sheet1!DA11+Sheet1!DB11+Sheet1!DC11","v":0},{"$f":"Sheet1!DD11+Sheet1!DE11","v":0},{"$f":"Sheet1!DE11+Sheet1!DF11","v":0},{"$f":"Sheet1!DG11+Sheet1!DH11","v":0},{"$f":"Sheet1!DJ11+Sheet1!DI11+Sheet1!DK11","v":0},{"$f":"Sheet1!DJ11+Sheet1!DL11+Sheet1!DM11","v":0},{"$f":"Sheet1!DO11+Sheet1!DP11","v":0},{"$f":"Sheet1!DQ11+Sheet1!DR11","v":0},{"$f":"Sheet1!DS11+Sheet1!DT11+Sheet1!DU11","v":0},{"$f":"Sheet1!DS11+Sheet1!DV11+Sheet1!DW11","v":0},{"$f":"Sheet1!DX11+Sheet1!DY11","v":0},{"$f":"Sheet1!DZ11+Sheet1!EA11+Sheet1!EB11","v":0}]
[{"$f":"Sheet1!F12+Sheet1!G12+Sheet1!H12","v":0},{"$f":"Sheet1!J12+Sheet1!K12","v":0},{"$f":"Sheet1!K12+Sheet1!L12","v":0},{"$f":"Sheet1!K12+Sheet1!M12+Sheet1!N12","v":0},{"$f":"Sheet1!O12+Sheet1!P12","v":0},{"$f":"Sheet1!O12+Sheet1!Q12+Sheet1!R12","v":0},{"$f":"Sheet1!O12+Sheet1!S12","v":0},{"$f":"Sheet1!O12+Sheet1!T12","v":0},{"$f":"Sheet1!Q12+Sheet1!R12","v":0},{"$f":"Sheet1!U12+Sheet1!V12+Sheet1!W12","v":0},{"$f":"Sheet1!U12+Sheet1!V12+Sheet1!X12","v":0},{"$f":"Sheet1!Y12+Sheet1!Z12","v":0},{"$f":"Sheet1!Z12+Sheet1!AA12","v":0},{"$f":"Sheet1!Z12+Sheet1!AB12","v":0},{"$f":"Sheet1!AC12+Sheet1!AD12","v":0},{"$f":"Sheet1!AD12+Sheet1!AE12+Sheet1!AF12","v":0},{"$f":"Sheet1!AG12+Sheet1!AH12","v":0},{"$f":"Sheet1!AG12+Sheet1!AI12","v":0},{"$f":"Sheet1!AJ12+Sheet1!AK12","v":0},{"$f":"Sheet1!AL12+Sheet1!AM12","v":0},{"$f":"Sheet1!AO12+Sheet1!AN12","v":0},{"$f":"Sheet1!AO12+Sheet1!AP12","v":0},{"$f":"Sheet1!AT12+Sheet1!AS12","v":0},{"$f":"Sheet1!AU12+Sheet1!AT12+Sheet1!AV12","v":0},{"$f":"Sheet1!AU12+Sheet1!AV12+Sheet1!AW12","v":0},{"$f":"Sheet1!AU12+Sheet1!AX12+Sheet1!AY12","v":0},{"$f":"Sheet1!AU12+Sheet1!AZ12","v":0},{"$f":"Sheet1!AU12+Sheet1!BA12","v":0},{"$f":"Sheet1!BB12+Sheet1!BC12","v":0},{"$f":"Sheet1!BD12+Sheet1!BE12+Sheet1!BF12","v":0},{"$f":"Sheet1!BD12+Sheet1!BG12","v":0},{"$f":"Sheet1!BH12+Sheet1!BI12","v":0},{"$f":"Sheet1!BI12+Sheet1!BJ12+Sheet1!BK12","v":0},{"$f":"Sheet1!BJ12+Sheet1!BL12","v":0},{"$f":"Sheet1!BM12+Sheet1!BN12","v":0},{"$f":"Sheet1!BO12+Sheet1!BP12+Sheet1!BQ12","v":0},{"$f":"Sheet1!BO12+Sheet1!BR12+Sheet1!BS12","v":0},{"$f":"Sheet1!BO12+Sheet1!BR12+Sheet1!BT12","v":0},{"$f":"Sheet1!BO12+Sheet1!BU12+Sheet1!BT12","v":0},{"$f":"Sheet1!BO12+Sheet1!BT12+Sheet1!BV12","v":0},{"$f":"Sheet1!BW12+Sheet1!BX12","v":0},{"$f":"Sheet1!BW12+Sheet1!BY12+Sheet1!BZ12","v":0},{"$f":"Sheet1!BY12+Sheet1!CA12+Sheet1!CB12","v":0},{"$f":"Sheet1!CA12+Sheet1!CC12","v":0},{"$f":"Sheet1!CA12+Sheet1!CD12","v":0},{"$f":"Sheet1!CD12+Sheet1!CE12+Sheet1!CF12","v":0},{"$f":"Sheet1!CH12+Sheet1!CI12","v":0},{"$f":"Sheet1!CJ12+Sheet1!CK12","v":0},{"$f":"Sheet1!CL12+Sheet1!CM12","v":0},{"$f":"Sheet1!CL12+Sheet1!CN12","v":0},{"$f":"Sheet1!CL12+Sheet1!CO12+Sheet1!CP12","v":0},{"$f":"Sheet1!CL12+Sheet1!CQ12+Sheet1!CR12","v":0},{"$f":"Sheet1!CL12+Sheet1!CS12","v":0},{"$f":"Sheet1!CT12+Sheet1!CU12+Sheet1!CV12","v":0},{"$f":"Sheet1!CW12+Sheet1!CX12+Sheet1!CY12","v":0},{"$f":"Sheet1!CZ12+Sheet1!DA12","v":0},{"$f":"Sheet1!DA12+Sheet1!DB12+Sheet1!DC12","v":0},{"$f":"Sheet1!DD12+Sheet1!DE12","v":0},{"$f":"Sheet1!DE12+Sheet1!DF12","v":0},{"$f":"Sheet1!DG12+Sheet1!DH12","v":0},{"$f":"Sheet1!DJ12+Sheet1!DI12+Sheet1!DK12","v":0},{"$f":"Sheet1!DJ12+Sheet1!DL12+Sheet1!DM12","v":0},{"$f":"Sheet1!DO12+Sheet1!DP12","v":0},{"$f":"Sheet1!DQ12+Sheet1!DR12","v":0},{"$f":"Sheet1!DS12+Sheet1!DT12+Sheet1!DU12","v":0},{"$f":"Sheet1!DS12+Sheet1!DV12+Sheet1!DW12","v":0},{"$f":"Sheet1!DX12+Sheet1!DY12","v":0},{"$f":"Sheet1!DZ12+Sheet1!EA12+Sheet1!EB12","v":0},null,{"$f":"IF(OR(BR6>0,BR10>0,BR8>0),1,0)","v":0}]
[{"$f":"Sheet1!F13+Sheet1!G13+Sheet1!H13","v":0},{"$f":"Sheet1!J13+Sheet1!K13","v":0},{"$f":"Sheet1!K13+Sheet1!L13","v":0},{"$f":"Sheet1!K13+Sheet1!M13+Sheet1!N13","v":0},{"$f":"Sheet1!O13+Sheet1!P13","v":0},{"$f":"Sheet1!O13+Sheet1!Q13+Sheet1!R13","v":0},{"$f":"Sheet1!O13+Sheet1!S13","v":0},{"$f":"Sheet1!O13+Sheet1!T13","v":0},{"$f":"Sheet1!Q13+Sheet1!R13","v":0},{"$f":"Sheet1!U13+Sheet1!V13+Sheet1!W13","v":0},{"$f":"Sheet1!U13+Sheet1!V13+Sheet1!X13","v":0},{"$f":"Sheet1!Y13+Sheet1!Z13","v":0},{"$f":"Sheet1!Z13+Sheet1!AA13","v":0},{"$f":"Sheet1!Z13+Sheet1!AB13","v":0},{"$f":"Sheet1!AC13+Sheet1!AD13","v":0},{"$f":"Sheet1!AD13+Sheet1!AE13+Sheet1!AF13","v":0},{"$f":"Sheet1!AG13+Sheet1!AH13","v":0},{"$f":"Sheet1!AG13+Sheet1!AI13","v":0},{"$f":"Sheet1!AJ13+Sheet1!AK13","v":0},{"$f":"Sheet1!AL13+Sheet1!AM13","v":0},{"$f":"Sheet1!AO13+Sheet1!AN13","v":0},{"$f":"Sheet1!AO13+Sheet1!AP13","v":0},{"$f":"Sheet1!AT13+Sheet1!AS13","v":0},{"$f":"Sheet1!AU13+Sheet1!AT13+Sheet1!AV13","v":0},{"$f":"Sheet1!AU13+Sheet1!AV13+Sheet1!AW13","v":0},{"$f":"Sheet1!AU13+Sheet1!AX13+Sheet1!AY13","v":0},{"$f":"Sheet1!AU13+Sheet1!AZ13","v":0},{"$f":"Sheet1!AU13+Sheet1!BA13","v":0},{"$f":"Sheet1!BB13+Sheet1!BC13","v":0},{"$f":"Sheet1!BD13+Sheet1!BE13+Sheet1!BF13","v":0},{"$f":"Sheet1!BD13+Sheet1!BG13","v":0},{"$f":"Sheet1!BH13+Sheet1!BI13","v":0},{"$f":"Sheet1!BI13+Sheet1!BJ13+Sheet1!BK13","v":0},{"$f":"Sheet1!BJ13+Sheet1!BL13","v":0},{"$f":"Sheet1!BM13+Sheet1!BN13","v":0},{"$f":"Sheet1!BO13+Sheet1!BP13+Sheet1!BQ13","v":0},{"$f":"Sheet1!BO13+Sheet1!BR13+Sheet1!BS13","v":0},{"$f":"Sheet1!BO13+Sheet1!BR13+Sheet1!BT13","v":0},{"$f":"Sheet1!BO13+Sheet1!BU13+Sheet1!BT13","v":0},{"$f":"Sheet1!BO13+Sheet1!BT13+Sheet1!BV13","v":0},{"$f":"Sheet1!BW13+Sheet1!BX13","v":0},{"$f":"Sheet1!BW13+Sheet1!BY13+Sheet1!BZ13","v":0},{"$f":"Sheet1!BY13+Sheet1!CA13+Sheet1!CB13","v":0},{"$f":"Sheet1!CA13+Sheet1!CC13","v":0},{"$f":"Sheet1!CA13+Sheet1!CD13","v":0},{"$f":"Sheet1!CD13+Sheet1!CE13+Sheet1!CF13","v":0},{"$f":"Sheet1!CH13+Sheet1!CI13","v":0},{"$f":"Sheet1!CJ13+Sheet1!CK13","v":0},{"$f":"Sheet1!CL13+Sheet1!CM13","v":0},{"$f":"Sheet1!CL13+Sheet1!CN13","v":0},{"$f":"Sheet1!CL13+Sheet1!CO13+Sheet1!CP13","v":0},{"$f":"Sheet1!CL13+Sheet1!CQ13+Sheet1!CR13","v":0},{"$f":"Sheet1!CL13+Sheet1!CS13","v":0},{"$f":"Sheet1!CT13+Sheet1!CU13+Sheet1!CV13","v":0},{"$f":"Sheet1!CW13+Sheet1!CX13+Sheet1!CY13","v":0},{"$f":"Sheet1!CZ13+Sheet1!DA13","v":0},{"$f":"Sheet1!DA13+Sheet1!DB13+Sheet1!DC13","v":0},{"$f":"Sheet1!DD13+Sheet1!DE13","v":0},{"$f":"Sheet1!DE13+Sheet1!DF13","v":0},{"$f":"Sheet1!DG13+Sheet1!DH13","v":0},{"$f":"Sheet1!DJ13+Sheet1!DI13+Sheet1!DK13","v":0},{"$f":"Sheet1!DJ13+Sheet1!DL13+Sheet1!DM13","v":0},{"$f":"Sheet1!DO13+Sheet1!DP13","v":0},{"$f":"Sheet1!DQ13+Sheet1!DR13","v":0},{"$f":"Sheet1!DS13+Sheet1!DT13+Sheet1!DU13","v":0},{"$f":"Sheet1!DS13+Sheet1!DV13+Sheet1!DW13","v":0},{"$f":"Sheet1!DX13+Sheet1!DY13","v":0},{"$f":"Sheet1!DZ13+Sheet1!EA13+Sheet1!EB13","v":0}]
[{"$f":"Sheet1!F14+Sheet1!G14+Sheet1!H14","v":0},{"$f":"Sheet1!J14+Sheet1!K14","v":0},{"$f":"Sheet1!K14+Sheet1!L14","v":0},{"$f":"Sheet1!K14+Sheet1!M14+Sheet1!N14","v":0},{"$f":"Sheet1!O14+Sheet1!P14","v":0},{"$f":"Sheet1!O14+Sheet1!Q14+Sheet1!R14","v":0},{"$f":"Sheet1!O14+Sheet1!S14","v":0},{"$f":"Sheet1!O14+Sheet1!T14","v":0},{"$f":"Sheet1!Q14+Sheet1!R14","v":0},{"$f":"Sheet1!U14+Sheet1!V14+Sheet1!W14","v":0},{"$f":"Sheet1!U14+Sheet1!V14+Sheet1!X14","v":0},{"$f":"Sheet1!Y14+Sheet1!Z14","v":0},{"$f":"Sheet1!Z14+Sheet1!AA14","v":0},{"$f":"Sheet1!Z14+Sheet1!AB14","v":0},{"$f":"Sheet1!AC14+Sheet1!AD14","v":0},{"$f":"Sheet1!AD14+Sheet1!AE14+Sheet1!AF14","v":0},{"$f":"Sheet1!AG14+Sheet1!AH14","v":0},{"$f":"Sheet1!AG14+Sheet1!AI14","v":0},{"$f":"Sheet1!AJ14+Sheet1!AK14","v":0},{"$f":"Sheet1!AL14+Sheet1!AM14","v":0},{"$f":"Sheet1!AO14+Sheet1!AN14","v":0},{"$f":"Sheet1!AO14+Sheet1!AP14","v":0},{"$f":"Sheet1!AT14+Sheet1!AS14","v":0},{"$f":"Sheet1!AU14+Sheet1!AT14+Sheet1!AV14","v":0},{"$f":"Sheet1!AU14+Sheet1!AV14+Sheet1!AW14","v":0},{"$f":"Sheet1!AU14+Sheet1!AX14+Sheet1!AY14","v":0},{"$f":"Sheet1!AU14+Sheet1!AZ14","v":0},{"$f":"Sheet1!AU14+Sheet1!BA14","v":0},{"$f":"Sheet1!BB14+Sheet1!BC14","v":0},{"$f":"Sheet1!BD14+Sheet1!BE14+Sheet1!BF14","v":0},{"$f":"Sheet1!BD14+Sheet1!BG14","v":0},{"$f":"Sheet1!BH14+Sheet1!BI14","v":0},{"$f":"Sheet1!BI14+Sheet1!BJ14+Sheet1!BK14","v":0},{"$f":"Sheet1!BJ14+Sheet1!BL14","v":0},{"$f":"Sheet1!BM14+Sheet1!BN14","v":0},{"$f":"Sheet1!BO14+Sheet1!BP14+Sheet1!BQ14","v":0},{"$f":"Sheet1!BO14+Sheet1!BR14+Sheet1!BS14","v":0},{"$f":"Sheet1!BO14+Sheet1!BR14+Sheet1!BT14","v":0},{"$f":"Sheet1!BO14+Sheet1!BU14+Sheet1!BT14","v":0},{"$f":"Sheet1!BO14+Sheet1!BT14+Sheet1!BV14","v":0},{"$f":"Sheet1!BW14+Sheet1!BX14","v":0},{"$f":"Sheet1!BW14+Sheet1!BY14+Sheet1!BZ14","v":0},{"$f":"Sheet1!BY14+Sheet1!CA14+Sheet1!CB14","v":0},{"$f":"Sheet1!CA14+Sheet1!CC14","v":0},{"$f":"Sheet1!CA14+Sheet1!CD14","v":0},{"$f":"Sheet1!CD14+Sheet1!CE14+Sheet1!CF14","v":0},{"$f":"Sheet1!CH14+Sheet1!CI14","v":0},{"$f":"Sheet1!CJ14+Sheet1!CK14","v":0},{"$f":"Sheet1!CL14+Sheet1!CM14","v":0},{"$f":"Sheet1!CL14+Sheet1!CN14","v":0},{"$f":"Sheet1!CL14+Sheet1!CO14+Sheet1!CP14","v":0},{"$f":"Sheet1!CL14+Sheet1!CQ14+Sheet1!CR14","v":0},{"$f":"Sheet1!CL14+Sheet1!CS14","v":0},{"$f":"Sheet1!CT14+Sheet1!CU14+Sheet1!CV14","v":0},{"$f":"Sheet1!CW14+Sheet1!CX14+Sheet1!CY14","v":0},{"$f":"Sheet1!CZ14+Sheet1!DA14","v":0},{"$f":"Sheet1!DA14+Sheet1!DB14+Sheet1!DC14","v":0},{"$f":"Sheet1!DD14+Sheet1!DE14","v":0},{"$f":"Sheet1!DE14+Sheet1!DF14","v":0},{"$f":"Sheet1!DG14+Sheet1!DH14","v":0},{"$f":"Sheet1!DJ14+Sheet1!DI14+Sheet1!DK14","v":0},{"$f":"Sheet1!DJ14+Sheet1!DL14+Sheet1!DM14","v":0},{"$f":"Sheet1!DO14+Sheet1!DP14","v":0},{"$f":"Sheet1!DQ14+Sheet1!DR14","v":0},{"$f":"Sheet1!DS14+Sheet1!DT14+Sheet1!DU14","v":0},{"$f":"Sheet1!DS14+Sheet1!DV14+Sheet1!DW14","v":0},{"$f":"Sheet1!DX14+Sheet1!DY14","v":0},{"$f":"Sheet1!DZ14+Sheet1!EA14+Sheet1!EB14","v":0}]
[{"$f":"Sheet1!F15+Sheet1!G15+Sheet1!H15","v":0},{"$f":"Sheet1!J15+Sheet1!K15","v":0},{"$f":"Sheet1!K15+Sheet1!L15","v":0},{"$f":"Sheet1!K15+Sheet1!M15+Sheet1!N15","v":0},{"$f":"Sheet1!O15+Sheet1!P15","v":0},{"$f":"Sheet1!O15+Sheet1!Q15+Sheet1!R15","v":0},{"$f":"Sheet1!O15+Sheet1!S15","v":0},{"$f":"Sheet1!O15+Sheet1!T15","v":0},{"$f":"Sheet1!Q15+Sheet1!R15","v":0},{"$f":"Sheet1!U15+Sheet1!V15+Sheet1!W15","v":0},{"$f":"Sheet1!U15+Sheet1!V15+Sheet1!X15","v":0},{"$f":"Sheet1!Y15+Sheet1!Z15","v":0},{"$f":"Sheet1!Z15+Sheet1!AA15","v":0},{"$f":"Sheet1!Z15+Sheet1!AB15","v":0},{"$f":"Sheet1!AC15+Sheet1!AD15","v":0},{"$f":"Sheet1!AD15+Sheet1!AE15+Sheet1!AF15","v":0},{"$f":"Sheet1!AG15+Sheet1!AH15","v":0},{"$f":"Sheet1!AG15+Sheet1!AI15","v":0},{"$f":"Sheet1!AJ15+Sheet1!AK15","v":0},{"$f":"Sheet1!AL15+Sheet1!AM15","v":0},{"$f":"Sheet1!AO15+Sheet1!AN15","v":0},{"$f":"Sheet1!AO15+Sheet1!AP15","v":0},{"$f":"Sheet1!AT15+Sheet1!AS15","v":0},{"$f":"Sheet1!AU15+Sheet1!AT15+Sheet1!AV15","v":0},{"$f":"Sheet1!AU15+Sheet1!AV15+Sheet1!AW15","v":0},{"$f":"Sheet1!AU15+Sheet1!AX15+Sheet1!AY15","v":0},{"$f":"Sheet1!AU15+Sheet1!AZ15","v":0},{"$f":"Sheet1!AU15+Sheet1!BA15","v":0},{"$f":"Sheet1!BB15+Sheet1!BC15","v":0},{"$f":"Sheet1!BD15+Sheet1!BE15+Sheet1!BF15","v":0},{"$f":"Sheet1!BD15+Sheet1!BG15","v":0},{"$f":"Sheet1!BH15+Sheet1!BI15","v":0},{"$f":"Sheet1!BI15+Sheet1!BJ15+Sheet1!BK15","v":0},{"$f":"Sheet1!BJ15+Sheet1!BL15","v":0},{"$f":"Sheet1!BM15+Sheet1!BN15","v":0},{"$f":"Sheet1!BO15+Sheet1!BP15+Sheet1!BQ15","v":0},{"$f":"Sheet1!BO15+Sheet1!BR15+Sheet1!BS15","v":0},{"$f":"Sheet1!BO15+Sheet1!BR15+Sheet1!BT15","v":0},{"$f":"Sheet1!BO15+Sheet1!BU15+Sheet1!BT15","v":0},{"$f":"Sheet1!BO15+Sheet1!BT15+Sheet1!BV15","v":0},{"$f":"Sheet1!BW15+Sheet1!BX15","v":0},{"$f":"Sheet1!BW15+Sheet1!BY15+Sheet1!BZ15","v":0},{"$f":"Sheet1!BY15+Sheet1!CA15+Sheet1!CB15","v":0},{"$f":"Sheet1!CA15+Sheet1!CC15","v":0},{"$f":"Sheet1!CA15+Sheet1!CD15","v":0},{"$f":"Sheet1!CD15+Sheet1!CE15+Sheet1!CF15","v":0},{"$f":"Sheet1!CH15+Sheet1!CI15","v":0},{"$f":"Sheet1!CJ15+Sheet1!CK15","v":0},{"$f":"Sheet1!CL15+Sheet1!CM15","v":0},{"$f":"Sheet1!CL15+Sheet1!CN15","v":0},{"$f":"Sheet1!CL15+Sheet1!CO15+Sheet1!CP15","v":0},{"$f":"Sheet1!CL15+Sheet1!CQ15+Sheet1!CR15","v":0},{"$f":"Sheet1!CL15+Sheet1!CS15","v":0},{"$f":"Sheet1!CT15+Sheet1!CU15+Sheet1!CV15","v":0},{"$f":"Sheet1!CW15+Sheet1!CX15+Sheet1!CY15","v":0},{"$f":"Sheet1!CZ15+Sheet1!DA15","v":0},{"$f":"Sheet1!DA15+Sheet1!DB15+Sheet1!DC15","v":0},{"$f":"Sheet1!DD15+Sheet1!DE15","v":0},{"$f":"Sheet1!DE15+Sheet1!DF15","v":0},{"$f":"Sheet1!DG15+Sheet1!DH15","v":0},{"$f":"Sheet1!DJ15+Sheet1!DI15+Sheet1!DK15","v":0},{"$f":"Sheet1!DJ15+Sheet1!DL15+Sheet1!DM15","v":0},{"$f":"Sheet1!DO15+Sheet1!DP15","v":0},{"$f":"Sheet1!DQ15+Sheet1!DR15","v":0},{"$f":"Sheet1!DS15+Sheet1!DT15+Sheet1!DU15","v":0},{"$f":"Sheet1!DS15+Sheet1!DV15+Sheet1!DW15","v":0},{"$f":"Sheet1!DX15+Sheet1!DY15","v":0},{"$f":"Sheet1!DZ15+Sheet1!EA15+Sheet1!EB15","v":0}]
[{"$f":"Sheet1!F16+Sheet1!G16+Sheet1!H16","v":0},{"$f":"Sheet1!J16+Sheet1!K16","v":0},{"$f":"Sheet1!K16+Sheet1!L16","v":0},{"$f":"Sheet1!K16+Sheet1!M16+Sheet1!N16","v":0},{"$f":"Sheet1!O16+Sheet1!P16","v":0},{"$f":"Sheet1!O16+Sheet1!Q16+Sheet1!R16","v":0},{"$f":"Sheet1!O16+Sheet1!S16","v":0},{"$f":"Sheet1!O16+Sheet1!T16","v":0},{"$f":"Sheet1!Q16+Sheet1!R16","v":0},{"$f":"Sheet1!U16+Sheet1!V16+Sheet1!W16","v":0},{"$f":"Sheet1!U16+Sheet1!V16+Sheet1!X16","v":0},{"$f":"Sheet1!Y16+Sheet1!Z16","v":0},{"$f":"Sheet1!Z16+Sheet1!AA16","v":0},{"$f":"Sheet1!Z16+Sheet1!AB16","v":0},{"$f":"Sheet1!AC16+Sheet1!AD16","v":0},{"$f":"Sheet1!AD16+Sheet1!AE16+Sheet1!AF16","v":0},{"$f":"Sheet1!AG16+Sheet1!AH16","v":0},{"$f":"Sheet1!AG16+Sheet1!AI16","v":0},{"$f":"Sheet1!AJ16+Sheet1!AK16","v":0},{"$f":"Sheet1!AL16+Sheet1!AM16","v":0},{"$f":"Sheet1!AO16+Sheet1!AN16","v":0},{"$f":"Sheet1!AO16+Sheet1!AP16","v":0},{"$f":"Sheet1!AT16+Sheet1!AS16","v":0},{"$f":"Sheet1!AU16+Sheet1!AT16+Sheet1!AV16","v":0},{"$f":"Sheet1!AU16+Sheet1!AV16+Sheet1!AW16","v":0},{"$f":"Sheet1!AU16+Sheet1!AX16+Sheet1!AY16","v":0},{"$f":"Sheet1!AU16+Sheet1!AZ16","v":0},{"$f":"Sheet1!AU16+Sheet1!BA16","v":0},{"$f":"Sheet1!BB16+Sheet1!BC16","v":0},{"$f":"Sheet1!BD16+Sheet1!BE16+Sheet1!BF16","v":0},{"$f":"Sheet1!BD16+Sheet1!BG16","v":0},{"$f":"Sheet1!BH16+Sheet1!BI16","v":0},{"$f":"Sheet1!BI16+Sheet1!BJ16+Sheet1!BK16","v":0},{"$f":"Sheet1!BJ16+Sheet1!BL16","v":0},{"$f":"Sheet1!BM16+Sheet1!BN16","v":0},{"$f":"Sheet1!BO16+Sheet1!BP16+Sheet1!BQ16","v":0},{"$f":"Sheet1!BO16+Sheet1!BR16+Sheet1!BS16","v":0},{"$f":"Sheet1!BO16+Sheet1!BR16+Sheet1!BT16","v":0},{"$f":"Sheet1!BO16+Sheet1!BU16+Sheet1!BT16","v":0},{"$f":"Sheet1!BO16+Sheet1!BT16+Sheet1!BV16","v":0},{"$f":"Sheet1!BW16+Sheet1!BX16","v":0},{"$f":"Sheet1!BW16+Sheet1!BY16+Sheet1!BZ16","v":0},{"$f":"Sheet1!BY16+Sheet1!CA16+Sheet1!CB16","v":0},{"$f":"Sheet1!CA16+Sheet1!CC16","v":0},{"$f":"Sheet1!CA16+Sheet1!CD16","v":0},{"$f":"Sheet1!CD16+Sheet1!CE16+Sheet1!CF16","v":0},{"$f":"Sheet1!CH16+Sheet1!CI16","v":0},{"$f":"Sheet1!CJ16+Sheet1!CK16","v":0},{"$f":"Sheet1!CL16+Sheet1!CM16","v":0},{"$f":"Sheet1!CL16+Sheet1!CN16","v":0},{"$f":"Sheet1!CL16+Sheet1!CO16+Sheet1!CP16","v":0},{"$f":"Sheet1!CL16+Sheet1!CQ16+Sheet1!CR16","v":0},{"$f":"Sheet1!CL16+Sheet1!CS16","v":0},{"$f":"Sheet1!CT16+Sheet1!CU16+Sheet1!CV16","v":0},{"$f":"Sheet1!CW16+Sheet1!CX16+Sheet1!CY16","v":0},{"$f":"Sheet1!CZ16+Sheet1!DA16","v":0},{"$f":"Sheet1!DA16+Sheet1!DB16+Sheet1!DC16","v":0},{"$f":"Sheet1!DD16+Sheet1!DE16","v":0},{"$f":"Sheet1!DE16+Sheet1!DF16","v":0},{"$f":"Sheet1!DG16+Sheet1!DH16","v":0},{"$f":"Sheet1!DJ16+Sheet1!DI16+Sheet1!DK16","v":0},{"$f":"Sheet1!DJ16+Sheet1!DL16+Sheet1!DM16","v":0},{"$f":"Sheet1!DO16+Sheet1!DP16","v":0},{"$f":"Sheet1!DQ16+Sheet1!DR16","v":0},{"$f":"Sheet1!DS16+Sheet1!DT16+Sheet1!DU16","v":0},{"$f":"Sheet1!DS16+Sheet1!DV16+Sheet1!DW16","v":0},{"$f":"Sheet1!DX16+Sheet1!DY16","v":0},{"$f":"Sheet1!DZ16+Sheet1!EA16+Sheet1!EB16","v":0}]
[{"$f":"Sheet1!F17+Sheet1!G17+Sheet1!H17","v":0},{"$f":"Sheet1!J17+Sheet1!K17","v":0},{"$f":"Sheet1!K17+Sheet1!L17","v":0},{"$f":"Sheet1!K17+Sheet1!M17+Sheet1!N17","v":0},{"$f":"Sheet1!O17+Sheet1!P17","v":0},{"$f":"Sheet1!O17+Sheet1!Q17+Sheet1!R17","v":0},{"$f":"Sheet1!O17+Sheet1!S17","v":0},{"$f":"Sheet1!O17+Sheet1!T17","v":0},{"$f":"Sheet1!Q17+Sheet1!R17","v":0},{"$f":"Sheet1!U17+Sheet1!V17+Sheet1!W17","v":0},{"$f":"Sheet1!U17+Sheet1!V17+Sheet1!X17","v":0},{"$f":"Sheet1!Y17+Sheet1!Z17","v":0},{"$f":"Sheet1!Z17+Sheet1!AA17","v":0},{"$f":"Sheet1!Z17+Sheet1!AB17","v":0},{"$f":"Sheet1!AC17+Sheet1!AD17","v":0},{"$f":"Sheet1!AD17+Sheet1!AE17+Sheet1!AF17","v":0},{"$f":"Sheet1!AG17+Sheet1!AH17","v":0},{"$f":"Sheet1!AG17+Sheet1!AI17","v":0},{"$f":"Sheet1!AJ17+Sheet1!AK17","v":0},{"$f":"Sheet1!AL17+Sheet1!AM17","v":0},{"$f":"Sheet1!AO17+Sheet1!AN17","v":0},{"$f":"Sheet1!AO17+Sheet1!AP17","v":0},{"$f":"Sheet1!AT17+Sheet1!AS17","v":0},{"$f":"Sheet1!AU17+Sheet1!AT17+Sheet1!AV17","v":0},{"$f":"Sheet1!AU17+Sheet1!AV17+Sheet1!AW17","v":0},{"$f":"Sheet1!AU17+Sheet1!AX17+Sheet1!AY17","v":0},{"$f":"Sheet1!AU17+Sheet1!AZ17","v":0},{"$f":"Sheet1!AU17+Sheet1!BA17","v":0},{"$f":"Sheet1!BB17+Sheet1!BC17","v":0},{"$f":"Sheet1!BD17+Sheet1!BE17+Sheet1!BF17","v":0},{"$f":"Sheet1!BD17+Sheet1!BG17","v":0},{"$f":"Sheet1!BH17+Sheet1!BI17","v":0},{"$f":"Sheet1!BI17+Sheet1!BJ17+Sheet1!BK17","v":0},{"$f":"Sheet1!BJ17+Sheet1!BL17","v":0},{"$f":"Sheet1!BM17+Sheet1!BN17","v":0},{"$f":"Sheet1!BO17+Sheet1!BP17+Sheet1!BQ17","v":0},{"$f":"Sheet1!BO17+Sheet1!BR17+Sheet1!BS17","v":0},{"$f":"Sheet1!BO17+Sheet1!BR17+Sheet1!BT17","v":0},{"$f":"Sheet1!BO17+Sheet1!BU17+Sheet1!BT17","v":0},{"$f":"Sheet1!BO17+Sheet1!BT17+Sheet1!BV17","v":0},{"$f":"Sheet1!BW17+Sheet1!BX17","v":0},{"$f":"Sheet1!BW17+Sheet1!BY17+Sheet1!BZ17","v":0},{"$f":"Sheet1!BY17+Sheet1!CA17+Sheet1!CB17","v":0},{"$f":"Sheet1!CA17+Sheet1!CC17","v":0},{"$f":"Sheet1!CA17+Sheet1!CD17","v":0},{"$f":"Sheet1!CD17+Sheet1!CE17+Sheet1!CF17","v":0},{"$f":"Sheet1!CH17+Sheet1!CI17","v":0},{"$f":"Sheet1!CJ17+Sheet1!CK17","v":0},{"$f":"Sheet1!CL17+Sheet1!CM17","v":0},{"$f":"Sheet1!CL17+Sheet1!CN17","v":0},{"$f":"Sheet1!CL17+Sheet1!CO17+Sheet1!CP17","v":0},{"$f":"Sheet1!CL17+Sheet1!CQ17+Sheet1!CR17","v":0},{"$f":"Sheet1!CL17+Sheet1!CS17","v":0},{"$f":"Sheet1!CT17+Sheet1!CU17+Sheet1!CV17","v":0},{"$f":"Sheet1!CW17+Sheet1!CX17+Sheet1!CY17","v":0},{"$f":"Sheet1!CZ17+Sheet1!DA17","v":0},{"$f":"Sheet1!DA17+Sheet1!DB17+Sheet1!DC17","v":0},{"$f":"Sheet1!DD17+Sheet1!DE17","v":0},{"$f":"Sheet1!DE17+Sheet1!DF17","v":0},{"$f":"Sheet1!DG17+Sheet1!DH17","v":0},{"$f":"Sheet1!DJ17+Sheet1!DI17+Sheet1!DK17","v":0},{"$f":"Sheet1!DJ17+Sheet1!DL17+Sheet1!DM17","v":0},{"$f":"Sheet1!DO17+Sheet1!DP17","v":0},{"$f":"Sheet1!DQ17+Sheet1!DR17","v":0},{"$f":"Sheet1!DS17+Sheet1!DT17+Sheet1!DU17","v":0},{"$f":"Sheet1!DS17+Sheet1!DV17+Sheet1!DW17","v":0},{"$f":"Sheet1!DX17+Sheet1!DY17","v":0},{"$f":"Sheet1!DZ17+Sheet1!EA17+Sheet1!EB17","v":0}]
[{"$f":"Sheet1!F18+Sheet1!G18+Sheet1!H18","v":0},{"$f":"Sheet1!J18+Sheet1!K18","v":0},{"$f":"Sheet1!K18+Sheet1!L18","v":0},{"$f":"Sheet1!K18+Sheet1!M18+Sheet1!N18","v":0},{"$f":"Sheet1!O18+Sheet1!P18","v":0},{"$f":"Sheet1!O18+Sheet1!Q18+Sheet1!R18","v":0},{"$f":"Sheet1!O18+Sheet1!S18","v":0},{"$f":"Sheet1!O18+Sheet1!T18","v":0},{"$f":"Sheet1!Q18+Sheet1!R18","v":0},{"$f":"Sheet1!U18+Sheet1!V18+Sheet1!W18","v":0},{"$f":"Sheet1!U18+Sheet1!V18+Sheet1!X18","v":0},{"$f":"Sheet1!Y18+Sheet1!Z18","v":0},{"$f":"Sheet1!Z18+Sheet1!AA18","v":0},{"$f":"Sheet1!Z18+Sheet1!AB18","v":0},{"$f":"Sheet1!AC18+Sheet1!AD18","v":0},{"$f":"Sheet1!AD18+Sheet1!AE18+Sheet1!AF18","v":0},{"$f":"Sheet1!AG18+Sheet1!AH18","v":0},{"$f":"Sheet1!AG18+Sheet1!AI18","v":0},{"$f":"Sheet1!AJ18+Sheet1!AK18","v":0},{"$f":"Sheet1!AL18+Sheet1!AM18","v":0},{"$f":"Sheet1!AO18+Sheet1!AN18","v":0},{"$f":"Sheet1!AO18+Sheet1!AP18","v":0},{"$f":"Sheet1!AT18+Sheet1!AS18","v":0},{"$f":"Sheet1!AU18+Sheet1!AT18+Sheet1!AV18","v":0},{"$f":"Sheet1!AU18+Sheet1!AV18+Sheet1!AW18","v":0},{"$f":"Sheet1!AU18+Sheet1!AX18+Sheet1!AY18","v":0},{"$f":"Sheet1!AU18+Sheet1!AZ18","v":0},{"$f":"Sheet1!AU18+Sheet1!BA18","v":0},{"$f":"Sheet1!BB18+Sheet1!BC18","v":0},{"$f":"Sheet1!BD18+Sheet1!BE18+Sheet1!BF18","v":0},{"$f":"Sheet1!BD18+Sheet1!BG18","v":0},{"$f":"Sheet1!BH18+Sheet1!BI18","v":0},{"$f":"Sheet1!BI18+Sheet1!BJ18+Sheet1!BK18","v":0},{"$f":"Sheet1!BJ18+Sheet1!BL18","v":0},{"$f":"Sheet1!BM18+Sheet1!BN18","v":0},{"$f":"Sheet1!BO18+Sheet1!BP18+Sheet1!BQ18","v":0},{"$f":"Sheet1!BO18+Sheet1!BR18+Sheet1!BS18","v":0},{"$f":"Sheet1!BO18+Sheet1!BR18+Sheet1!BT18","v":0},{"$f":"Sheet1!BO18+Sheet1!BU18+Sheet1!BT18","v":0},{"$f":"Sheet1!BO18+Sheet1!BT18+Sheet1!BV18","v":0},{"$f":"Sheet1!BW18+Sheet1!BX18","v":0},{"$f":"Sheet1!BW18+Sheet1!BY18+Sheet1!BZ18","v":0},{"$f":"Sheet1!BY18+Sheet1!CA18+Sheet1!CB18","v":0},{"$f":"Sheet1!CA18+Sheet1!CC18","v":0},{"$f":"Sheet1!CA18+Sheet1!CD18","v":0},{"$f":"Sheet1!CD18+Sheet1!CE18+Sheet1!CF18","v":0},{"$f":"Sheet1!CH18+Sheet1!CI18","v":0},{"$f":"Sheet1!CJ18+Sheet1!CK18","v":0},{"$f":"Sheet1!CL18+Sheet1!CM18","v":0},{"$f":"Sheet1!CL18+Sheet1!CN18","v":0},{"$f":"Sheet1!CL18+Sheet1!CO18+Sheet1!CP18","v":0},{"$f":"Sheet1!CL18+Sheet1!CQ18+Sheet1!CR18","v":0},{"$f":"Sheet1!CL18+Sheet1!CS18","v":0},{"$f":"Sheet1!CT18+Sheet1!CU18+Sheet1!CV18","v":0},{"$f":"Sheet1!CW18+Sheet1!CX18+Sheet1!CY18","v":0},{"$f":"Sheet1!CZ18+Sheet1!DA18","v":0},{"$f":"Sheet1!DA18+Sheet1!DB18+Sheet1!DC18","v":0},{"$f":"Sheet1!DD18+Sheet1!DE18","v":0},{"$f":"Sheet1!DE18+Sheet1!DF18","v":0},{"$f":"Sheet1!DG18+Sheet1!DH18","v":0},{"$f":"Sheet1!DJ18+Sheet1!DI18+Sheet1!DK18","v":0},{"$f":"Sheet1!DJ18+Sheet1!DL18+Sheet1!DM18","v":0},{"$f":"Sheet1!DO18+Sheet1!DP18","v":0},{"$f":"Sheet1!DQ18+Sheet1!DR18","v":0},{"$f":"Sheet1!DS18+Sheet1!DT18+Sheet1!DU18","v":0},{"$f":"Sheet1!DS18+Sheet1!DV18+Sheet1!DW18","v":0},{"$f":"Sheet1!DX18+Sheet1!DY18","v":0},{"$f":"Sheet1!DZ18+Sheet1!EA18+Sheet1!EB18","v":0}]
[{"$f":"Sheet1!F19+Sheet1!G19+Sheet1!H19","v":0},{"$f":"Sheet1!J19+Sheet1!K19","v":0},{"$f":"Sheet1!K19+Sheet1!L19","v":0},{"$f":"Sheet1!K19+Sheet1!M19+Sheet1!N19","v":0},{"$f":"Sheet1!O19+Sheet1!P19","v":0},{"$f":"Sheet1!O19+Sheet1!Q19+Sheet1!R19","v":0},{"$f":"Sheet1!O19+Sheet1!S19","v":0},{"$f":"Sheet1!O19+Sheet1!T19","v":0},{"$f":"Sheet1!Q19+Sheet1!R19","v":0},{"$f":"Sheet1!U19+Sheet1!V19+Sheet1!W19","v":0},{"$f":"Sheet1!U19+Sheet1!V19+Sheet1!X19","v":0},{"$f":"Sheet1!Y19+Sheet1!Z19","v":0},{"$f":"Sheet1!Z19+Sheet1!AA19","v":0},{"$f":"Sheet1!Z19+Sheet1!AB19","v":0},{"$f":"Sheet1!AC19+Sheet1!AD19","v":0},{"$f":"Sheet1!AD19+Sheet1!AE19+Sheet1!AF19","v":0},{"$f":"Sheet1!AG19+Sheet1!AH19","v":0},{"$f":"Sheet1!AG19+Sheet1!AI19","v":0},{"$f":"Sheet1!AJ19+Sheet1!AK19","v":0},{"$f":"Sheet1!AL19+Sheet1!AM19","v":0},{"$f":"Sheet1!AO19+Sheet1!AN19","v":0},{"$f":"Sheet1!AO19+Sheet1!AP19","v":0},{"$f":"Sheet1!AT19+Sheet1!AS19","v":0},{"$f":"Sheet1!AU19+Sheet1!AT19+Sheet1!AV19","v":0},{"$f":"Sheet1!AU19+Sheet1!AV19+Sheet1!AW19","v":0},{"$f":"Sheet1!AU19+Sheet1!AX19+Sheet1!AY19","v":0},{"$f":"Sheet1!AU19+Sheet1!AZ19","v":0},{"$f":"Sheet1!AU19+Sheet1!BA19","v":0},{"$f":"Sheet1!BB19+Sheet1!BC19","v":0},{"$f":"Sheet1!BD19+Sheet1!BE19+Sheet1!BF19","v":0},{"$f":"Sheet1!BD19+Sheet1!BG19","v":0},{"$f":"Sheet1!BH19+Sheet1!BI19","v":0},{"$f":"Sheet1!BI19+Sheet1!BJ19+Sheet1!BK19","v":0},{"$f":"Sheet1!BJ19+Sheet1!BL19","v":0},{"$f":"Sheet1!BM19+Sheet1!BN19","v":0},{"$f":"Sheet1!BO19+Sheet1!BP19+Sheet1!BQ19","v":0},{"$f":"Sheet1!BO19+Sheet1!BR19+Sheet1!BS19","v":0},{"$f":"Sheet1!BO19+Sheet1!BR19+Sheet1!BT19","v":0},{"$f":"Sheet1!BO19+Sheet1!BU19+Sheet1!BT19","v":0},{"$f":"Sheet1!BO19+Sheet1!BT19+Sheet1!BV19","v":0},{"$f":"Sheet1!BW19+Sheet1!BX19","v":0},{"$f":"Sheet1!BW19+Sheet1!BY19+Sheet1!BZ19","v":0},{"$f":"Sheet1!BY19+Sheet1!CA19+Sheet1!CB19","v":0},{"$f":"Sheet1!CA19+Sheet1!CC19","v":0},{"$f":"Sheet1!CA19+Sheet1!CD19","v":0},{"$f":"Sheet1!CD19+Sheet1!CE19+Sheet1!CF19","v":0},{"$f":"Sheet1!CH19+Sheet1!CI19","v":0},{"$f":"Sheet1!CJ19+Sheet1!CK19","v":0},{"$f":"Sheet1!CL19+Sheet1!CM19","v":0},{"$f":"Sheet1!CL19+Sheet1!CN19","v":0},{"$f":"Sheet1!CL19+Sheet1!CO19+Sheet1!CP19","v":0},{"$f":"Sheet1!CL19+Sheet1!CQ19+Sheet1!CR19","v":0},{"$f":"Sheet1!CL19+Sheet1!CS19","v":0},{"$f":"Sheet1!CT19+Sheet1!CU19+Sheet1!CV19","v":0},{"$f":"Sheet1!CW19+Sheet1!CX19+Sheet1!CY19","v":0},{"$f":"Sheet1!CZ19+Sheet1!DA19","v":0},{"$f":"Sheet1!DA19+Sheet1!DB19+Sheet1!DC19","v":0},{"$f":"Sheet1!DD19+Sheet1!DE19","v":0},{"$f":"Sheet1!DE19+Sheet1!DF19","v":0},{"$f":"Sheet1!DG19+Sheet1!DH19","v":0},{"$f":"Sheet1!DJ19+Sheet1!DI19+Sheet1!DK19","v":0},{"$f":"Sheet1!DJ19+Sheet1!DL19+Sheet1!DM19","v":0},{"$f":"Sheet1!DO19+Sheet1!DP19","v":0},{"$f":"Sheet1!DQ19+Sheet1!DR19","v":0},{"$f":"Sheet1!DS19+Sheet1!DT19+Sheet1!DU19","v":0},{"$f":"Sheet1!DS19+Sheet1!DV19+Sheet1!DW19","v":0},{"$f":"Sheet1!DX19+Sheet1!DY19","v":0},{"$f":"Sheet1!DZ19+Sheet1!EA19+Sheet1!EB19","v":0}]
[{"$f":"Sheet1!F20+Sheet1!G20+Sheet1!H20","v":0},{"$f":"Sheet1!J20+Sheet1!K20","v":0},{"$f":"Sheet1!K20+Sheet1!L20","v":0},{"$f":"Sheet1!K20+Sheet1!M20+Sheet1!N20","v":0},{"$f":"Sheet1!O20+Sheet1!P20","v":0},{"$f":"Sheet1!O20+Sheet1!Q20+Sheet1!R20","v":0},{"$f":"Sheet1!O20+Sheet1!S20","v":0},{"$f":"Sheet1!O20+Sheet1!T20","v":0},{"$f":"Sheet1!Q20+Sheet1!R20","v":0},{"$f":"Sheet1!U20+Sheet1!V20+Sheet1!W20","v":0},{"$f":"Sheet1!U20+Sheet1!V20+Sheet1!X20","v":0},{"$f":"Sheet1!Y20+Sheet1!Z20","v":0},{"$f":"Sheet1!Z20+Sheet1!AA20","v":0},{"$f":"Sheet1!Z20+Sheet1!AB20","v":0},{"$f":"Sheet1!AC20+Sheet1!AD20","v":0},{"$f":"Sheet1!AD20+Sheet1!AE20+Sheet1!AF20","v":0},{"$f":"Sheet1!AG20+Sheet1!AH20","v":0},{"$f":"Sheet1!AG20+Sheet1!AI20","v":0},{"$f":"Sheet1!AJ20+Sheet1!AK20","v":0},{"$f":"Sheet1!AL20+Sheet1!AM20","v":0},{"$f":"Sheet1!AO20+Sheet1!AN20","v":0},{"$f":"Sheet1!AO20+Sheet1!AP20","v":0},{"$f":"Sheet1!AT20+Sheet1!AS20","v":0},{"$f":"Sheet1!AU20+Sheet1!AT20+Sheet1!AV20","v":0},{"$f":"Sheet1!AU20+Sheet1!AV20+Sheet1!AW20","v":0},{"$f":"Sheet1!AU20+Sheet1!AX20+Sheet1!AY20","v":0},{"$f":"Sheet1!AU20+Sheet1!AZ20","v":0},{"$f":"Sheet1!AU20+Sheet1!BA20","v":0},{"$f":"Sheet1!BB20+Sheet1!BC20","v":0},{"$f":"Sheet1!BD20+Sheet1!BE20+Sheet1!BF20","v":0},{"$f":"Sheet1!BD20+Sheet1!BG20","v":0},{"$f":"Sheet1!BH20+Sheet1!BI20","v":0},{"$f":"Sheet1!BI20+Sheet1!BJ20+Sheet1!BK20","v":0},{"$f":"Sheet1!BJ20+Sheet1!BL20","v":0},{"$f":"Sheet1!BM20+Sheet1!BN20","v":0},{"$f":"Sheet1!BO20+Sheet1!BP20+Sheet1!BQ20","v":0},{"$f":"Sheet1!BO20+Sheet1!BR20+Sheet1!BS20","v":0},{"$f":"Sheet1!BO20+Sheet1!BR20+Sheet1!BT20","v":0},{"$f":"Sheet1!BO20+Sheet1!BU20+Sheet1!BT20","v":0},{"$f":"Sheet1!BO20+Sheet1!BT20+Sheet1!BV20","v":0},{"$f":"Sheet1!BW20+Sheet1!BX20","v":0},{"$f":"Sheet1!BW20+Sheet1!BY20+Sheet1!BZ20","v":0},{"$f":"Sheet1!BY20+Sheet1!CA20+Sheet1!CB20","v":0},{"$f":"Sheet1!CA20+Sheet1!CC20","v":0},{"$f":"Sheet1!CA20+Sheet1!CD20","v":0},{"$f":"Sheet1!CD20+Sheet1!CE20+Sheet1!CF20","v":0},{"$f":"Sheet1!CH20+Sheet1!CI20","v":0},{"$f":"Sheet1!CJ20+Sheet1!CK20","v":0},{"$f":"Sheet1!CL20+Sheet1!CM20","v":0},{"$f":"Sheet1!CL20+Sheet1!CN20","v":0},{"$f":"Sheet1!CL20+Sheet1!CO20+Sheet1!CP20","v":0},{"$f":"Sheet1!CL20+Sheet1!CQ20+Sheet1!CR20","v":0},{"$f":"Sheet1!CL20+Sheet1!CS20","v":0},{"$f":"Sheet1!CT20+Sheet1!CU20+Sheet1!CV20","v":0},{"$f":"Sheet1!CW20+Sheet1!CX20+Sheet1!CY20","v":0},{"$f":"Sheet1!CZ20+Sheet1!DA20","v":0},{"$f":"Sheet1!DA20+Sheet1!DB20+Sheet1!DC20","v":0},{"$f":"Sheet1!DD20+Sheet1!DE20","v":0},{"$f":"Sheet1!DE20+Sheet1!DF20","v":0},{"$f":"Sheet1!DG20+Sheet1!DH20","v":0},{"$f":"Sheet1!DJ20+Sheet1!DI20+Sheet1!DK20","v":0},{"$f":"Sheet1!DJ20+Sheet1!DL20+Sheet1!DM20","v":0},{"$f":"Sheet1!DO20+Sheet1!DP20","v":0},{"$f":"Sheet1!DQ20+Sheet1!DR20","v":0},{"$f":"Sheet1!DS20+Sheet1!DT20+Sheet1!DU20","v":0},{"$f":"Sheet1!DS20+Sheet1!DV20+Sheet1!DW20","v":0},{"$f":"Sheet1!DX20+Sheet1!DY20","v":0},{"$f":"Sheet1!DZ20+Sheet1!EA20+Sheet1!EB20","v":0}]
[{"$f":"Sheet1!F21+Sheet1!G21+Sheet1!H21","v":0},{"$f":"Sheet1!J21+Sheet1!K21","v":0},{"$f":"Sheet1!K21+Sheet1!L21","v":0},{"$f":"Sheet1!K21+Sheet1!M21+Sheet1!N21","v":0},{"$f":"Sheet1!O21+Sheet1!P21","v":0},{"$f":"Sheet1!O21+Sheet1!Q21+Sheet1!R21","v":0},{"$f":"Sheet1!O21+Sheet1!S21","v":0},{"$f":"Sheet1!O21+Sheet1!T21","v":0},{"$f":"Sheet1!Q21+Sheet1!R21","v":0},{"$f":"Sheet1!U21+Sheet1!V21+Sheet1!W21","v":0},{"$f":"Sheet1!U21+Sheet1!V21+Sheet1!X21","v":0},{"$f":"Sheet1!Y21+Sheet1!Z21","v":0},{"$f":"Sheet1!Z21+Sheet1!AA21","v":0},{"$f":"Sheet1!Z21+Sheet1!AB21","v":0},{"$f":"Sheet1!AC21+Sheet1!AD21","v":0},{"$f":"Sheet1!AD21+Sheet1!AE21+Sheet1!AF21","v":0},{"$f":"Sheet1!AG21+Sheet1!AH21","v":0},{"$f":"Sheet1!AG21+Sheet1!AI21","v":0},{"$f":"Sheet1!AJ21+Sheet1!AK21","v":0},{"$f":"Sheet1!AL21+Sheet1!AM21","v":0},{"$f":"Sheet1!AO21+Sheet1!AN21","v":0},{"$f":"Sheet1!AO21+Sheet1!AP21","v":0},{"$f":"Sheet1!AT21+Sheet1!AS21","v":0},{"$f":"Sheet1!AU21+Sheet1!AT21+Sheet1!AV21","v":0},{"$f":"Sheet1!AU21+Sheet1!AV21+Sheet1!AW21","v":0},{"$f":"Sheet1!AU21+Sheet1!AX21+Sheet1!AY21","v":0},{"$f":"Sheet1!AU21+Sheet1!AZ21","v":0},{"$f":"Sheet1!AU21+Sheet1!BA21","v":0},{"$f":"Sheet1!BB21+Sheet1!BC21","v":0},{"$f":"Sheet1!BD21+Sheet1!BE21+Sheet1!BF21","v":0},{"$f":"Sheet1!BD21+Sheet1!BG21","v":0},{"$f":"Sheet1!BH21+Sheet1!BI21","v":0},{"$f":"Sheet1!BI21+Sheet1!BJ21+Sheet1!BK21","v":0},{"$f":"Sheet1!BJ21+Sheet1!BL21","v":0},{"$f":"Sheet1!BM21+Sheet1!BN21","v":0},{"$f":"Sheet1!BO21+Sheet1!BP21+Sheet1!BQ21","v":0},{"$f":"Sheet1!BO21+Sheet1!BR21+Sheet1!BS21","v":0},{"$f":"Sheet1!BO21+Sheet1!BR21+Sheet1!BT21","v":0},{"$f":"Sheet1!BO21+Sheet1!BU21+Sheet1!BT21","v":0},{"$f":"Sheet1!BO21+Sheet1!BT21+Sheet1!BV21","v":0},{"$f":"Sheet1!BW21+Sheet1!BX21","v":0},{"$f":"Sheet1!BW21+Sheet1!BY21+Sheet1!BZ21","v":0},{"$f":"Sheet1!BY21+Sheet1!CA21+Sheet1!CB21","v":0},{"$f":"Sheet1!CA21+Sheet1!CC21","v":0},{"$f":"Sheet1!CA21+Sheet1!CD21","v":0},{"$f":"Sheet1!CD21+Sheet1!CE21+Sheet1!CF21","v":0},{"$f":"Sheet1!CH21+Sheet1!CI21","v":0},{"$f":"Sheet1!CJ21+Sheet1!CK21","v":0},{"$f":"Sheet1!CL21+Sheet1!CM21","v":0},{"$f":"Sheet1!CL21+Sheet1!CN21","v":0},{"$f":"Sheet1!CL21+Sheet1!CO21+Sheet1!CP21","v":0},{"$f":"Sheet1!CL21+Sheet1!CQ21+Sheet1!CR21","v":0},{"$f":"Sheet1!CL21+Sheet1!CS21","v":0},{"$f":"Sheet1!CT21+Sheet1!CU21+Sheet1!CV21","v":0},{"$f":"Sheet1!CW21+Sheet1!CX21+Sheet1!CY21","v":0},{"$f":"Sheet1!CZ21+Sheet1!DA21","v":0},{"$f":"Sheet1!DA21+Sheet1!DB21+Sheet1!DC21","v":0},{"$f":"Sheet1!DD21+Sheet1!DE21","v":0},{"$f":"Sheet1!DE21+Sheet1!DF21","v":0},{"$f":"Sheet1!DG21+Sheet1!DH21","v":0},{"$f":"Sheet1!DJ21+Sheet1!DI21+Sheet1!DK21","v":0},{"$f":"Sheet1!DJ21+Sheet1!DL21+Sheet1!DM21","v":0},{"$f":"Sheet1!DO21+Sheet1!DP21","v":0},{"$f":"Sheet1!DQ21+Sheet1!DR21","v":0},{"$f":"Sheet1!DS21+Sheet1!DT21+Sheet1!DU21","v":0},{"$f":"Sheet1!DS21+Sheet1!DV21+Sheet1!DW21","v":0},{"$f":"Sheet1!DX21+Sheet1!DY21","v":0},{"$f":"Sheet1!DZ21+Sheet1!EA21+Sheet1!EB21","v":0}]
[{"$f":"Sheet1!F22+Sheet1!G22+Sheet1!H22","v":0},{"$f":"Sheet1!J22+Sheet1!K22","v":0},{"$f":"Sheet1!K22+Sheet1!L22","v":0},{"$f":"Sheet1!K22+Sheet1!M22+Sheet1!N22","v":0},{"$f":"Sheet1!O22+Sheet1!P22","v":0},{"$f":"Sheet1!O22+Sheet1!Q22+Sheet1!R22","v":0},{"$f":"Sheet1!O22+Sheet1!S22","v":0},{"$f":"Sheet1!O22+Sheet1!T22","v":0},{"$f":"Sheet1!Q22+Sheet1!R22","v":0},{"$f":"Sheet1!U22+Sheet1!V22+Sheet1!W22","v":0},{"$f":"Sheet1!U22+Sheet1!V22+Sheet1!X22","v":0},{"$f":"Sheet1!Y22+Sheet1!Z22","v":0},{"$f":"Sheet1!Z22+Sheet1!AA22","v":0},{"$f":"Sheet1!Z22+Sheet1!AB22","v":0},{"$f":"Sheet1!AC22+Sheet1!AD22","v":0},{"$f":"Sheet1!AD22+Sheet1!AE22+Sheet1!AF22","v":0},{"$f":"Sheet1!AG22+Sheet1!AH22","v":0},{"$f":"Sheet1!AG22+Sheet1!AI22","v":0},{"$f":"Sheet1!AJ22+Sheet1!AK22","v":0},{"$f":"Sheet1!AL22+Sheet1!AM22","v":0},{"$f":"Sheet1!AO22+Sheet1!AN22","v":0},{"$f":"Sheet1!AO22+Sheet1!AP22","v":0},{"$f":"Sheet1!AT22+Sheet1!AS22","v":0},{"$f":"Sheet1!AU22+Sheet1!AT22+Sheet1!AV22","v":0},{"$f":"Sheet1!AU22+Sheet1!AV22+Sheet1!AW22","v":0},{"$f":"Sheet1!AU22+Sheet1!AX22+Sheet1!AY22","v":0},{"$f":"Sheet1!AU22+Sheet1!AZ22","v":0},{"$f":"Sheet1!AU22+Sheet1!BA22","v":0},{"$f":"Sheet1!BB22+Sheet1!BC22","v":0},{"$f":"Sheet1!BD22+Sheet1!BE22+Sheet1!BF22","v":0},{"$f":"Sheet1!BD22+Sheet1!BG22","v":0},{"$f":"Sheet1!BH22+Sheet1!BI22","v":0},{"$f":"Sheet1!BI22+Sheet1!BJ22+Sheet1!BK22","v":0},{"$f":"Sheet1!BJ22+Sheet1!BL22","v":0},{"$f":"Sheet1!BM22+Sheet1!BN22","v":0},{"$f":"Sheet1!BO22+Sheet1!BP22+Sheet1!BQ22","v":0},{"$f":"Sheet1!BO22+Sheet1!BR22+Sheet1!BS22","v":0},{"$f":"Sheet1!BO22+Sheet1!BR22+Sheet1!BT22","v":0},{"$f":"Sheet1!BO22+Sheet1!BU22+Sheet1!BT22","v":0},{"$f":"Sheet1!BO22+Sheet1!BT22+Sheet1!BV22","v":0},{"$f":"Sheet1!BW22+Sheet1!BX22","v":0},{"$f":"Sheet1!BW22+Sheet1!BY22+Sheet1!BZ22","v":0},{"$f":"Sheet1!BY22+Sheet1!CA22+Sheet1!CB22","v":0},{"$f":"Sheet1!CA22+Sheet1!CC22","v":0},{"$f":"Sheet1!CA22+Sheet1!CD22","v":0},{"$f":"Sheet1!CD22+Sheet1!CE22+Sheet1!CF22","v":0},{"$f":"Sheet1!CH22+Sheet1!CI22","v":0},{"$f":"Sheet1!CJ22+Sheet1!CK22","v":0},{"$f":"Sheet1!CL22+Sheet1!CM22","v":0},{"$f":"Sheet1!CL22+Sheet1!CN22","v":0},{"$f":"Sheet1!CL22+Sheet1!CO22+Sheet1!CP22","v":0},{"$f":"Sheet1!CL22+Sheet1!CQ22+Sheet1!CR22","v":0},{"$f":"Sheet1!CL22+Sheet1!CS22","v":0},{"$f":"Sheet1!CT22+Sheet1!CU22+Sheet1!CV22","v":0},{"$f":"Sheet1!CW22+Sheet1!CX22+Sheet1!CY22","v":0},{"$f":"Sheet1!CZ22+Sheet1!DA22","v":0},{"$f":"Sheet1!DA22+Sheet1!DB22+Sheet1!DC22","v":0},{"$f":"Sheet1!DD22+Sheet1!DE22","v":0},{"$f":"Sheet1!DE22+Sheet1!DF22","v":0},{"$f":"Sheet1!DG22+Sheet1!DH22","v":0},{"$f":"Sheet1!DJ22+Sheet1!DI22+Sheet1!DK22","v":0},{"$f":"Sheet1!DJ22+Sheet1!DL22+Sheet1!DM22","v":0},{"$f":"Sheet1!DO22+Sheet1!DP22","v":0},{"$f":"Sheet1!DQ22+Sheet1!DR22","v":0},{"$f":"Sheet1!DS22+Sheet1!DT22+Sheet1!DU22","v":0},{"$f":"Sheet1!DS22+Sheet1!DV22+Sheet1!DW22","v":0},{"$f":"Sheet1!DX22+Sheet1!DY22","v":0},{"$f":"Sheet1!DZ22+Sheet1!EA22+Sheet1!EB22","v":0}]
[{"$f":"Sheet1!F23+Sheet1!G23+Sheet1!H23","v":0},{"$f":"Sheet1!J23+Sheet1!K23","v":0},{"$f":"Sheet1!K23+Sheet1!L23","v":0},{"$f":"Sheet1!K23+Sheet1!M23+Sheet1!N23","v":0},{"$f":"Sheet1!O23+Sheet1!P23","v":0},{"$f":"Sheet1!O23+Sheet1!Q23+Sheet1!R23","v":0},{"$f":"Sheet1!O23+Sheet1!S23","v":0},{"$f":"Sheet1!O23+Sheet1!T23","v":0},{"$f":"Sheet1!Q23+Sheet1!R23","v":0},{"$f":"Sheet1!U23+Sheet1!V23+Sheet1!W23","v":0},{"$f":"Sheet1!U23+Sheet1!V23+Sheet1!X23","v":0},{"$f":"Sheet1!Y23+Sheet1!Z23","v":0},{"$f":"Sheet1!Z23+Sheet1!AA23","v":0},{"$f":"Sheet1!Z23+Sheet1!AB23","v":0},{"$f":"Sheet1!AC23+Sheet1!AD23","v":0},{"$f":"Sheet1!AD23+Sheet1!AE23+Sheet1!AF23","v":0},{"$f":"Sheet1!AG23+Sheet1!AH23","v":0},{"$f":"Sheet1!AG23+Sheet1!AI23","v":0},{"$f":"Sheet1!AJ23+Sheet1!AK23","v":0},{"$f":"Sheet1!AL23+Sheet1!AM23","v":0},{"$f":"Sheet1!AO23+Sheet1!AN23","v":0},{"$f":"Sheet1!AO23+Sheet1!AP23","v":0},{"$f":"Sheet1!AT23+Sheet1!AS23","v":0},{"$f":"Sheet1!AU23+Sheet1!AT23+Sheet1!AV23","v":0},{"$f":"Sheet1!AU23+Sheet1!AV23+Sheet1!AW23","v":0},{"$f":"Sheet1!AU23+Sheet1!AX23+Sheet1!AY23","v":0},{"$f":"Sheet1!AU23+Sheet1!AZ23","v":0},{"$f":"Sheet1!AU23+Sheet1!BA23","v":0},{"$f":"Sheet1!BB23+Sheet1!BC23","v":0},{"$f":"Sheet1!BD23+Sheet1!BE23+Sheet1!BF23","v":0},{"$f":"Sheet1!BD23+Sheet1!BG23","v":0},{"$f":"Sheet1!BH23+Sheet1!BI23","v":0},{"$f":"Sheet1!BI23+Sheet1!BJ23+Sheet1!BK23","v":0},{"$f":"Sheet1!BJ23+Sheet1!BL23","v":0},{"$f":"Sheet1!BM23+Sheet1!BN23","v":0},{"$f":"Sheet1!BO23+Sheet1!BP23+Sheet1!BQ23","v":0},{"$f":"Sheet1!BO23+Sheet1!BR23+Sheet1!BS23","v":0},{"$f":"Sheet1!BO23+Sheet1!BR23+Sheet1!BT23","v":0},{"$f":"Sheet1!BO23+Sheet1!BU23+Sheet1!BT23","v":0},{"$f":"Sheet1!BO23+Sheet1!BT23+Sheet1!BV23","v":0},{"$f":"Sheet1!BW23+Sheet1!BX23","v":0},{"$f":"Sheet1!BW23+Sheet1!BY23+Sheet1!BZ23","v":0},{"$f":"Sheet1!BY23+Sheet1!CA23+Sheet1!CB23","v":0},{"$f":"Sheet1!CA23+Sheet1!CC23","v":0},{"$f":"Sheet1!CA23+Sheet1!CD23","v":0},{"$f":"Sheet1!CD23+Sheet1!CE23+Sheet1!CF23","v":0},{"$f":"Sheet1!CH23+Sheet1!CI23","v":0},{"$f":"Sheet1!CJ23+Sheet1!CK23","v":0},{"$f":"Sheet1!CL23+Sheet1!CM23","v":0},{"$f":"Sheet1!CL23+Sheet1!CN23","v":0},{"$f":"Sheet1!CL23+Sheet1!CO23+Sheet1!CP23","v":0},{"$f":"Sheet1!CL23+Sheet1!CQ23+Sheet1!CR23","v":0},{"$f":"Sheet1!CL23+Sheet1!CS23","v":0},{"$f":"Sheet1!CT23+Sheet1!CU23+Sheet1!CV23","v":0},{"$f":"Sheet1!CW23+Sheet1!CX23+Sheet1!CY23","v":0},{"$f":"Sheet1!CZ23+Sheet1!DA23","v":0},{"$f":"Sheet1!DA23+Sheet1!DB23+Sheet1!DC23","v":0},{"$f":"Sheet1!DD23+Sheet1!DE23","v":0},{"$f":"Sheet1!DE23+Sheet1!DF23","v":0},{"$f":"Sheet1!DG23+Sheet1!DH23","v":0},{"$f":"Sheet1!DJ23+Sheet1!DI23+Sheet1!DK23","v":0},{"$f":"Sheet1!DJ23+Sheet1!DL23+Sheet1!DM23","v":0},{"$f":"Sheet1!DO23+Sheet1!DP23","v":0},{"$f":"Sheet1!DQ23+Sheet1!DR23","v":0},{"$f":"Sheet1!DS23+Sheet1!DT23+Sheet1!DU23","v":0},{"$f":"Sheet1!DS23+Sheet1!DV23+Sheet1!DW23","v":0},{"$f":"Sheet1!DX23+Sheet1!DY23","v":0},{"$f":"Sheet1!DZ23+Sheet1!EA23+Sheet1!EB23","v":0}]
[{"$f":"Sheet1!F24+Sheet1!G24+Sheet1!H24","v":0},{"$f":"Sheet1!J24+Sheet1!K24","v":0},{"$f":"Sheet1!K24+Sheet1!L24","v":0},{"$f":"Sheet1!K24+Sheet1!M24+Sheet1!N24","v":0},{"$f":"Sheet1!O24+Sheet1!P24","v":0},{"$f":"Sheet1!O24+Sheet1!Q24+Sheet1!R24","v":0},{"$f":"Sheet1!O24+Sheet1!S24","v":0},{"$f":"Sheet1!O24+Sheet1!T24","v":0},{"$f":"Sheet1!Q24+Sheet1!R24","v":0},{"$f":"Sheet1!U24+Sheet1!V24+Sheet1!W24","v":0},{"$f":"Sheet1!U24+Sheet1!V24+Sheet1!X24","v":0},{"$f":"Sheet1!Y24+Sheet1!Z24","v":0},{"$f":"Sheet1!Z24+Sheet1!AA24","v":0},{"$f":"Sheet1!Z24+Sheet1!AB24","v":0},{"$f":"Sheet1!AC24+Sheet1!AD24","v":0},{"$f":"Sheet1!AD24+Sheet1!AE24+Sheet1!AF24","v":0},{"$f":"Sheet1!AG24+Sheet1!AH24","v":0},{"$f":"Sheet1!AG24+Sheet1!AI24","v":0},{"$f":"Sheet1!AJ24+Sheet1!AK24","v":0},{"$f":"Sheet1!AL24+Sheet1!AM24","v":0},{"$f":"Sheet1!AO24+Sheet1!AN24","v":0},{"$f":"Sheet1!AO24+Sheet1!AP24","v":0},{"$f":"Sheet1!AT24+Sheet1!AS24","v":0},{"$f":"Sheet1!AU24+Sheet1!AT24+Sheet1!AV24","v":0},{"$f":"Sheet1!AU24+Sheet1!AV24+Sheet1!AW24","v":0},{"$f":"Sheet1!AU24+Sheet1!AX24+Sheet1!AY24","v":0},{"$f":"Sheet1!AU24+Sheet1!AZ24","v":0},{"$f":"Sheet1!AU24+Sheet1!BA24","v":0},{"$f":"Sheet1!BB24+Sheet1!BC24","v":0},{"$f":"Sheet1!BD24+Sheet1!BE24+Sheet1!BF24","v":0},{"$f":"Sheet1!BD24+Sheet1!BG24","v":0},{"$f":"Sheet1!BH24+Sheet1!BI24","v":0},{"$f":"Sheet1!BI24+Sheet1!BJ24+Sheet1!BK24","v":0},{"$f":"Sheet1!BJ24+Sheet1!BL24","v":0},{"$f":"Sheet1!BM24+Sheet1!BN24","v":0},{"$f":"Sheet1!BO24+Sheet1!BP24+Sheet1!BQ24","v":0},{"$f":"Sheet1!BO24+Sheet1!BR24+Sheet1!BS24","v":0},{"$f":"Sheet1!BO24+Sheet1!BR24+Sheet1!BT24","v":0},{"$f":"Sheet1!BO24+Sheet1!BU24+Sheet1!BT24","v":0},{"$f":"Sheet1!BO24+Sheet1!BT24+Sheet1!BV24","v":0},{"$f":"Sheet1!BW24+Sheet1!BX24","v":0},{"$f":"Sheet1!BW24+Sheet1!BY24+Sheet1!BZ24","v":0},{"$f":"Sheet1!BY24+Sheet1!CA24+Sheet1!CB24","v":0},{"$f":"Sheet1!CA24+Sheet1!CC24","v":0},{"$f":"Sheet1!CA24+Sheet1!CD24","v":0},{"$f":"Sheet1!CD24+Sheet1!CE24+Sheet1!CF24","v":0},{"$f":"Sheet1!CH24+Sheet1!CI24","v":0},{"$f":"Sheet1!CJ24+Sheet1!CK24","v":0},{"$f":"Sheet1!CL24+Sheet1!CM24","v":0},{"$f":"Sheet1!CL24+Sheet1!CN24","v":0},{"$f":"Sheet1!CL24+Sheet1!CO24+Sheet1!CP24","v":0},{"$f":"Sheet1!CL24+Sheet1!CQ24+Sheet1!CR24","v":0},{"$f":"Sheet1!CL24+Sheet1!CS24","v":0},{"$f":"Sheet1!CT24+Sheet1!CU24+Sheet1!CV24","v":0},{"$f":"Sheet1!CW24+Sheet1!CX24+Sheet1!CY24","v":0},{"$f":"Sheet1!CZ24+Sheet1!DA24","v":0},{"$f":"Sheet1!DA24+Sheet1!DB24+Sheet1!DC24","v":0},{"$f":"Sheet1!DD24+Sheet1!DE24","v":0},{"$f":"Sheet1!DE24+Sheet1!DF24","v":0},{"$f":"Sheet1!DG24+Sheet1!DH24","v":0},{"$f":"Sheet1!DJ24+Sheet1!DI24+Sheet1!DK24","v":0},{"$f":"Sheet1!DJ24+Sheet1!DL24+Sheet1!DM24","v":0},{"$f":"Sheet1!DO24+Sheet1!DP24","v":0},{"$f":"Sheet1!DQ24+Sheet1!DR24","v":0},{"$f":"Sheet1!DS24+Sheet1!DT24+Sheet1!DU24","v":0},{"$f":"Sheet1!DS24+Sheet1!DV24+Sheet1!DW24","v":0},{"$f":"Sheet1!DX24+Sheet1!DY24","v":0},{"$f":"Sheet1!DZ24+Sheet1!EA24+Sheet1!EB24","v":0}]
[{"$f":"Sheet1!F25+Sheet1!G25+Sheet1!H25","v":0},{"$f":"Sheet1!J25+Sheet1!K25","v":0},{"$f":"Sheet1!K25+Sheet1!L25","v":0},{"$f":"Sheet1!K25+Sheet1!M25+Sheet1!N25","v":0},{"$f":"Sheet1!O25+Sheet1!P25","v":0},{"$f":"Sheet1!O25+Sheet1!Q25+Sheet1!R25","v":0},{"$f":"Sheet1!O25+Sheet1!S25","v":0},{"$f":"Sheet1!O25+Sheet1!T25","v":0},{"$f":"Sheet1!Q25+Sheet1!R25","v":0},{"$f":"Sheet1!U25+Sheet1!V25+Sheet1!W25","v":0},{"$f":"Sheet1!U25+Sheet1!V25+Sheet1!X25","v":0},{"$f":"Sheet1!Y25+Sheet1!Z25","v":0},{"$f":"Sheet1!Z25+Sheet1!AA25","v":0},{"$f":"Sheet1!Z25+Sheet1!AB25","v":0},{"$f":"Sheet1!AC25+Sheet1!AD25","v":0},{"$f":"Sheet1!AD25+Sheet1!AE25+Sheet1!AF25","v":0},{"$f":"Sheet1!AG25+Sheet1!AH25","v":0},{"$f":"Sheet1!AG25+Sheet1!AI25","v":0},{"$f":"Sheet1!AJ25+Sheet1!AK25","v":0},{"$f":"Sheet1!AL25+Sheet1!AM25","v":0},{"$f":"Sheet1!AO25+Sheet1!AN25","v":0},{"$f":"Sheet1!AO25+Sheet1!AP25","v":0},{"$f":"Sheet1!AT25+Sheet1!AS25","v":0},{"$f":"Sheet1!AU25+Sheet1!AT25+Sheet1!AV25","v":0},{"$f":"Sheet1!AU25+Sheet1!AV25+Sheet1!AW25","v":0},{"$f":"Sheet1!AU25+Sheet1!AX25+Sheet1!AY25","v":0},{"$f":"Sheet1!AU25+Sheet1!AZ25","v":0},{"$f":"Sheet1!AU25+Sheet1!BA25","v":0},{"$f":"Sheet1!BB25+Sheet1!BC25","v":0},{"$f":"Sheet1!BD25+Sheet1!BE25+Sheet1!BF25","v":0},{"$f":"Sheet1!BD25+Sheet1!BG25","v":0},{"$f":"Sheet1!BH25+Sheet1!BI25","v":0},{"$f":"Sheet1!BI25+Sheet1!BJ25+Sheet1!BK25","v":0},{"$f":"Sheet1!BJ25+Sheet1!BL25","v":0},{"$f":"Sheet1!BM25+Sheet1!BN25","v":0},{"$f":"Sheet1!BO25+Sheet1!BP25+Sheet1!BQ25","v":0},{"$f":"Sheet1!BO25+Sheet1!BR25+Sheet1!BS25","v":0},{"$f":"Sheet1!BO25+Sheet1!BR25+Sheet1!BT25","v":0},{"$f":"Sheet1!BO25+Sheet1!BU25+Sheet1!BT25","v":0},{"$f":"Sheet1!BO25+Sheet1!BT25+Sheet1!BV25","v":0},{"$f":"Sheet1!BW25+Sheet1!BX25","v":0},{"$f":"Sheet1!BW25+Sheet1!BY25+Sheet1!BZ25","v":0},{"$f":"Sheet1!BY25+Sheet1!CA25+Sheet1!CB25","v":0},{"$f":"Sheet1!CA25+Sheet1!CC25","v":0},{"$f":"Sheet1!CA25+Sheet1!CD25","v":0},{"$f":"Sheet1!CD25+Sheet1!CE25+Sheet1!CF25","v":0},{"$f":"Sheet1!CH25+Sheet1!CI25","v":0},{"$f":"Sheet1!CJ25+Sheet1!CK25","v":0},{"$f":"Sheet1!CL25+Sheet1!CM25","v":0},{"$f":"Sheet1!CL25+Sheet1!CN25","v":0},{"$f":"Sheet1!CL25+Sheet1!CO25+Sheet1!CP25","v":0},{"$f":"Sheet1!CL25+Sheet1!CQ25+Sheet1!CR25","v":0},{"$f":"Sheet1!CL25+Sheet1!CS25","v":0},{"$f":"Sheet1!CT25+Sheet1!CU25+Sheet1!CV25","v":0},{"$f":"Sheet1!CW25+Sheet1!CX25+Sheet1!CY25","v":0},{"$f":"Sheet1!CZ25+Sheet1!DA25","v":0},{"$f":"Sheet1!DA25+Sheet1!DB25+Sheet1!DC25","v":0},{"$f":"Sheet1!DD25+Sheet1!DE25","v":0},{"$f":"Sheet1!DE25+Sheet1!DF25","v":0},{"$f":"Sheet1!DG25+Sheet1!DH25","v":0},{"$f":"Sheet1!DJ25+Sheet1!DI25+Sheet1!DK25","v":0},{"$f":"Sheet1!DJ25+Sheet1!DL25+Sheet1!DM25","v":0},{"$f":"Sheet1!DO25+Sheet1!DP25","v":0},{"$f":"Sheet1!DQ25+Sheet1!DR25","v":0},{"$f":"Sheet1!DS25+Sheet1!DT25+Sheet1!DU25","v":0},{"$f":"Sheet1!DS25+Sheet1!DV25+Sheet1!DW25","v":0},{"$f":"Sheet1!DX25+Sheet1!DY25","v":0},{"$f":"Sheet1!DZ25+Sheet1!EA25+Sheet1!EB25","v":0}]
[{"$f":"Sheet1!F26+Sheet1!G26+Sheet1!H26","v":0},{"$f":"Sheet1!J26+Sheet1!K26","v":0},{"$f":"Sheet1!K26+Sheet1!L26","v":0},{"$f":"Sheet1!K26+Sheet1!M26+Sheet1!N26","v":0},{"$f":"Sheet1!O26+Sheet1!P26","v":0},{"$f":"Sheet1!O26+Sheet1!Q26+Sheet1!R26","v":0},{"$f":"Sheet1!O26+Sheet1!S26","v":0},{"$f":"Sheet1!O26+Sheet1!T26","v":0},{"$f":"Sheet1!Q26+Sheet1!R26","v":0},{"$f":"Sheet1!U26+Sheet1!V26+Sheet1!W26","v":0},{"$f":"Sheet1!U26+Sheet1!V26+Sheet1!X26","v":0},{"$f":"Sheet1!Y26+Sheet1!Z26","v":0},{"$f":"Sheet1!Z26+Sheet1!AA26","v":0},{"$f":"Sheet1!Z26+Sheet1!AB26","v":0},{"$f":"Sheet1!AC26+Sheet1!AD26","v":0},{"$f":"Sheet1!AD26+Sheet1!AE26+Sheet1!AF26","v":0},{"$f":"Sheet1!AG26+Sheet1!AH26","v":0},{"$f":"Sheet1!AG26+Sheet1!AI26","v":0},{"$f":"Sheet1!AJ26+Sheet1!AK26","v":0},{"$f":"Sheet1!AL26+Sheet1!AM26","v":0},{"$f":"Sheet1!AO26+Sheet1!AN26","v":0},{"$f":"Sheet1!AO26+Sheet1!AP26","v":0},{"$f":"Sheet1!AT26+Sheet1!AS26","v":0},{"$f":"Sheet1!AU26+Sheet1!AT26+Sheet1!AV26","v":0},{"$f":"Sheet1!AU26+Sheet1!AV26+Sheet1!AW26","v":0},{"$f":"Sheet1!AU26+Sheet1!AX26+Sheet1!AY26","v":0},{"$f":"Sheet1!AU26+Sheet1!AZ26","v":0},{"$f":"Sheet1!AU26+Sheet1!BA26","v":0},{"$f":"Sheet1!BB26+Sheet1!BC26","v":0},{"$f":"Sheet1!BD26+Sheet1!BE26+Sheet1!BF26","v":0},{"$f":"Sheet1!BD26+Sheet1!BG26","v":0},{"$f":"Sheet1!BH26+Sheet1!BI26","v":0},{"$f":"Sheet1!BI26+Sheet1!BJ26+Sheet1!BK26","v":0},{"$f":"Sheet1!BJ26+Sheet1!BL26","v":0},{"$f":"Sheet1!BM26+Sheet1!BN26","v":0},{"$f":"Sheet1!BO26+Sheet1!BP26+Sheet1!BQ26","v":0},{"$f":"Sheet1!BO26+Sheet1!BR26+Sheet1!BS26","v":0},{"$f":"Sheet1!BO26+Sheet1!BR26+Sheet1!BT26","v":0},{"$f":"Sheet1!BO26+Sheet1!BU26+Sheet1!BT26","v":0},{"$f":"Sheet1!BO26+Sheet1!BT26+Sheet1!BV26","v":0},{"$f":"Sheet1!BW26+Sheet1!BX26","v":0},{"$f":"Sheet1!BW26+Sheet1!BY26+Sheet1!BZ26","v":0},{"$f":"Sheet1!BY26+Sheet1!CA26+Sheet1!CB26","v":0},{"$f":"Sheet1!CA26+Sheet1!CC26","v":0},{"$f":"Sheet1!CA26+Sheet1!CD26","v":0},{"$f":"Sheet1!CD26+Sheet1!CE26+Sheet1!CF26","v":0},{"$f":"Sheet1!CH26+Sheet1!CI26","v":0},{"$f":"Sheet1!CJ26+Sheet1!CK26","v":0},{"$f":"Sheet1!CL26+Sheet1!CM26","v":0},{"$f":"Sheet1!CL26+Sheet1!CN26","v":0},{"$f":"Sheet1!CL26+Sheet1!CO26+Sheet1!CP26","v":0},{"$f":"Sheet1!CL26+Sheet1!CQ26+Sheet1!CR26","v":0},{"$f":"Sheet1!CL26+Sheet1!CS26","v":0},{"$f":"Sheet1!CT26+Sheet1!CU26+Sheet1!CV26","v":0},{"$f":"Sheet1!CW26+Sheet1!CX26+Sheet1!CY26","v":0},{"$f":"Sheet1!CZ26+Sheet1!DA26","v":0},{"$f":"Sheet1!DA26+Sheet1!DB26+Sheet1!DC26","v":0},{"$f":"Sheet1!DD26+Sheet1!DE26","v":0},{"$f":"Sheet1!DE26+Sheet1!DF26","v":0},{"$f":"Sheet1!DG26+Sheet1!DH26","v":0},{"$f":"Sheet1!DJ26+Sheet1!DI26+Sheet1!DK26","v":0},{"$f":"Sheet1!DJ26+Sheet1!DL26+Sheet1!DM26","v":0},{"$f":"Sheet1!DO26+Sheet1!DP26","v":0},{"$f":"Sheet1!DQ26+Sheet1!DR26","v":0},{"$f":"Sheet1!DS26+Sheet1!DT26+Sheet1!DU26","v":0},{"$f":"Sheet1!DS26+Sheet1!DV26+Sheet1!DW26","v":0},{"$f":"Sheet1!DX26+Sheet1!DY26","v":0},{"$f":"Sheet1!DZ26+Sheet1!EA26+Sheet1!EB26","v":0}]
[{"$f":"Sheet1!F27+Sheet1!G27+Sheet1!H27","v":0},{"$f":"Sheet1!J27+Sheet1!K27","v":0},{"$f":"Sheet1!K27+Sheet1!L27","v":0},{"$f":"Sheet1!K27+Sheet1!M27+Sheet1!N27","v":0},{"$f":"Sheet1!O27+Sheet1!P27","v":0},{"$f":"Sheet1!O27+Sheet1!Q27+Sheet1!R27","v":0},{"$f":"Sheet1!O27+Sheet1!S27","v":0},{"$f":"Sheet1!O27+Sheet1!T27","v":0},{"$f":"Sheet1!Q27+Sheet1!R27","v":0},{"$f":"Sheet1!U27+Sheet1!V27+Sheet1!W27","v":0},{"$f":"Sheet1!U27+Sheet1!V27+Sheet1!X27","v":0},{"$f":"Sheet1!Y27+Sheet1!Z27","v":0},{"$f":"Sheet1!Z27+Sheet1!AA27","v":0},{"$f":"Sheet1!Z27+Sheet1!AB27","v":0},{"$f":"Sheet1!AC27+Sheet1!AD27","v":0},{"$f":"Sheet1!AD27+Sheet1!AE27+Sheet1!AF27","v":0},{"$f":"Sheet1!AG27+Sheet1!AH27","v":0},{"$f":"Sheet1!AG27+Sheet1!AI27","v":0},{"$f":"Sheet1!AJ27+Sheet1!AK27","v":0},{"$f":"Sheet1!AL27+Sheet1!AM27","v":0},{"$f":"Sheet1!AO27+Sheet1!AN27","v":0},{"$f":"Sheet1!AO27+Sheet1!AP27","v":0},{"$f":"Sheet1!AT27+Sheet1!AS27","v":0},{"$f":"Sheet1!AU27+Sheet1!AT27+Sheet1!AV27","v":0},{"$f":"Sheet1!AU27+Sheet1!AV27+Sheet1!AW27","v":0},{"$f":"Sheet1!AU27+Sheet1!AX27+Sheet1!AY27","v":0},{"$f":"Sheet1!AU27+Sheet1!AZ27","v":0},{"$f":"Sheet1!AU27+Sheet1!BA27","v":0},{"$f":"Sheet1!BB27+Sheet1!BC27","v":0},{"$f":"Sheet1!BD27+Sheet1!BE27+Sheet1!BF27","v":0},{"$f":"Sheet1!BD27+Sheet1!BG27","v":0},{"$f":"Sheet1!BH27+Sheet1!BI27","v":0},{"$f":"Sheet1!BI27+Sheet1!BJ27+Sheet1!BK27","v":0},{"$f":"Sheet1!BJ27+Sheet1!BL27","v":0},{"$f":"Sheet1!BM27+Sheet1!BN27","v":0},{"$f":"Sheet1!BO27+Sheet1!BP27+Sheet1!BQ27","v":0},{"$f":"Sheet1!BO27+Sheet1!BR27+Sheet1!BS27","v":0},{"$f":"Sheet1!BO27+Sheet1!BR27+Sheet1!BT27","v":0},{"$f":"Sheet1!BO27+Sheet1!BU27+Sheet1!BT27","v":0},{"$f":"Sheet1!BO27+Sheet1!BT27+Sheet1!BV27","v":0},{"$f":"Sheet1!BW27+Sheet1!BX27","v":0},{"$f":"Sheet1!BW27+Sheet1!BY27+Sheet1!BZ27","v":0},{"$f":"Sheet1!BY27+Sheet1!CA27+Sheet1!CB27","v":0},{"$f":"Sheet1!CA27+Sheet1!CC27","v":0},{"$f":"Sheet1!CA27+Sheet1!CD27","v":0},{"$f":"Sheet1!CD27+Sheet1!CE27+Sheet1!CF27","v":0},{"$f":"Sheet1!CH27+Sheet1!CI27","v":0},{"$f":"Sheet1!CJ27+Sheet1!CK27","v":0},{"$f":"Sheet1!CL27+Sheet1!CM27","v":0},{"$f":"Sheet1!CL27+Sheet1!CN27","v":0},{"$f":"Sheet1!CL27+Sheet1!CO27+Sheet1!CP27","v":0},{"$f":"Sheet1!CL27+Sheet1!CQ27+Sheet1!CR27","v":0},{"$f":"Sheet1!CL27+Sheet1!CS27","v":0},{"$f":"Sheet1!CT27+Sheet1!CU27+Sheet1!CV27","v":0},{"$f":"Sheet1!CW27+Sheet1!CX27+Sheet1!CY27","v":0},{"$f":"Sheet1!CZ27+Sheet1!DA27","v":0},{"$f":"Sheet1!DA27+Sheet1!DB27+Sheet1!DC27","v":0},{"$f":"Sheet1!DD27+Sheet1!DE27","v":0},{"$f":"Sheet1!DE27+Sheet1!DF27","v":0},{"$f":"Sheet1!DG27+Sheet1!DH27","v":0},{"$f":"Sheet1!DJ27+Sheet1!DI27+Sheet1!DK27","v":0},{"$f":"Sheet1!DJ27+Sheet1!DL27+Sheet1!DM27","v":0},{"$f":"Sheet1!DO27+Sheet1!DP27","v":0},{"$f":"Sheet1!DQ27+Sheet1!DR27","v":0},{"$f":"Sheet1!DS27+Sheet1!DT27+Sheet1!DU27","v":0},{"$f":"Sheet1!DS27+Sheet1!DV27+Sheet1!DW27","v":0},{"$f":"Sheet1!DX27+Sheet1!DY27","v":0},{"$f":"Sheet1!DZ27+Sheet1!EA27+Sheet1!EB27","v":0}]
[{"$f":"Sheet1!F28+Sheet1!G28+Sheet1!H28","v":0},{"$f":"Sheet1!J28+Sheet1!K28","v":0},{"$f":"Sheet1!K28+Sheet1!L28","v":0},{"$f":"Sheet1!K28+Sheet1!M28+Sheet1!N28","v":0},{"$f":"Sheet1!O28+Sheet1!P28","v":0},{"$f":"Sheet1!O28+Sheet1!Q28+Sheet1!R28","v":0},{"$f":"Sheet1!O28+Sheet1!S28","v":0},{"$f":"Sheet1!O28+Sheet1!T28","v":0},{"$f":"Sheet1!Q28+Sheet1!R28","v":0},{"$f":"Sheet1!U28+Sheet1!V28+Sheet1!W28","v":0},{"$f":"Sheet1!U28+Sheet1!V28+Sheet1!X28","v":0},{"$f":"Sheet1!Y28+Sheet1!Z28","v":0},{"$f":"Sheet1!Z28+Sheet1!AA28","v":0},{"$f":"Sheet1!Z28+Sheet1!AB28","v":0},{"$f":"Sheet1!AC28+Sheet1!AD28","v":0},{"$f":"Sheet1!AD28+Sheet1!AE28+Sheet1!AF28","v":0},{"$f":"Sheet1!AG28+Sheet1!AH28","v":0},{"$f":"Sheet1!AG28+Sheet1!AI28","v":0},{"$f":"Sheet1!AJ28+Sheet1!AK28","v":0},{"$f":"Sheet1!AL28+Sheet1!AM28","v":0},{"$f":"Sheet1!AO28+Sheet1!AN28","v":0},{"$f":"Sheet1!AO28+Sheet1!AP28","v":0},{"$f":"Sheet1!AT28+Sheet1!AS28","v":0},{"$f":"Sheet1!AU28+Sheet1!AT28+Sheet1!AV28","v":0},{"$f":"Sheet1!AU28+Sheet1!AV28+Sheet1!AW28","v":0},{"$f":"Sheet1!AU28+Sheet1!AX28+Sheet1!AY28","v":0},{"$f":"Sheet1!AU28+Sheet1!AZ28","v":0},{"$f":"Sheet1!AU28+Sheet1!BA28","v":0},{"$f":"Sheet1!BB28+Sheet1!BC28","v":0},{"$f":"Sheet1!BD28+Sheet1!BE28+Sheet1!BF28","v":0},{"$f":"Sheet1!BD28+Sheet1!BG28","v":0},{"$f":"Sheet1!BH28+Sheet1!BI28","v":0},{"$f":"Sheet1!BI28+Sheet1!BJ28+Sheet1!BK28","v":0},{"$f":"Sheet1!BJ28+Sheet1!BL28","v":0},{"$f":"Sheet1!BM28+Sheet1!BN28","v":0},{"$f":"Sheet1!BO28+Sheet1!BP28+Sheet1!BQ28","v":0},{"$f":"Sheet1!BO28+Sheet1!BR28+Sheet1!BS28","v":0},{"$f":"Sheet1!BO28+Sheet1!BR28+Sheet1!BT28","v":0},{"$f":"Sheet1!BO28+Sheet1!BU28+Sheet1!BT28","v":0},{"$f":"Sheet1!BO28+Sheet1!BT28+Sheet1!BV28","v":0},{"$f":"Sheet1!BW28+Sheet1!BX28","v":0},{"$f":"Sheet1!BW28+Sheet1!BY28+Sheet1!BZ28","v":0},{"$f":"Sheet1!BY28+Sheet1!CA28+Sheet1!CB28","v":0},{"$f":"Sheet1!CA28+Sheet1!CC28","v":0},{"$f":"Sheet1!CA28+Sheet1!CD28","v":0},{"$f":"Sheet1!CD28+Sheet1!CE28+Sheet1!CF28","v":0},{"$f":"Sheet1!CH28+Sheet1!CI28","v":0},{"$f":"Sheet1!CJ28+Sheet1!CK28","v":0},{"$f":"Sheet1!CL28+Sheet1!CM28","v":0},{"$f":"Sheet1!CL28+Sheet1!CN28","v":0},{"$f":"Sheet1!CL28+Sheet1!CO28+Sheet1!CP28","v":0},{"$f":"Sheet1!CL28+Sheet1!CQ28+Sheet1!CR28","v":0},{"$f":"Sheet1!CL28+Sheet1!CS28","v":0},{"$f":"Sheet1!CT28+Sheet1!CU28+Sheet1!CV28","v":0},{"$f":"Sheet1!CW28+Sheet1!CX28+Sheet1!CY28","v":0},{"$f":"Sheet1!CZ28+Sheet1!DA28","v":0},{"$f":"Sheet1!DA28+Sheet1!DB28+Sheet1!DC28","v":0},{"$f":"Sheet1!DD28+Sheet1!DE28","v":0},{"$f":"Sheet1!DE28+Sheet1!DF28","v":0},{"$f":"Sheet1!DG28+Sheet1!DH28","v":0},{"$f":"Sheet1!DJ28+Sheet1!DI28+Sheet1!DK28","v":0},{"$f":"Sheet1!DJ28+Sheet1!DL28+Sheet1!DM28","v":0},{"$f":"Sheet1!DO28+Sheet1!DP28","v":0},{"$f":"Sheet1!DQ28+Sheet1!DR28","v":0},{"$f":"Sheet1!DS28+Sheet1!DT28+Sheet1!DU28","v":0},{"$f":"Sheet1!DS28+Sheet1!DV28+Sheet1!DW28","v":0},{"$f":"Sheet1!DX28+Sheet1!DY28","v":0},{"$f":"Sheet1!DZ28+Sheet1!EA28+Sheet1!EB28","v":0}]
[{"$f":"Sheet1!F29+Sheet1!G29+Sheet1!H29","v":0},{"$f":"Sheet1!J29+Sheet1!K29","v":0},{"$f":"Sheet1!K29+Sheet1!L29","v":0},{"$f":"Sheet1!K29+Sheet1!M29+Sheet1!N29","v":0},{"$f":"Sheet1!O29+Sheet1!P29","v":0},{"$f":"Sheet1!O29+Sheet1!Q29+Sheet1!R29","v":0},{"$f":"Sheet1!O29+Sheet1!S29","v":0},{"$f":"Sheet1!O29+Sheet1!T29","v":0},{"$f":"Sheet1!Q29+Sheet1!R29","v":0},{"$f":"Sheet1!U29+Sheet1!V29+Sheet1!W29","v":0},{"$f":"Sheet1!U29+Sheet1!V29+Sheet1!X29","v":0},{"$f":"Sheet1!Y29+Sheet1!Z29","v":0},{"$f":"Sheet1!Z29+Sheet1!AA29","v":0},{"$f":"Sheet1!Z29+Sheet1!AB29","v":0},{"$f":"Sheet1!AC29+Sheet1!AD29","v":0},{"$f":"Sheet1!AD29+Sheet1!AE29+Sheet1!AF29","v":0},{"$f":"Sheet1!AG29+Sheet1!AH29","v":0},{"$f":"Sheet1!AG29+Sheet1!AI29","v":0},{"$f":"Sheet1!AJ29+Sheet1!AK29","v":0},{"$f":"Sheet1!AL29+Sheet1!AM29","v":0},{"$f":"Sheet1!AO29+Sheet1!AN29","v":0},{"$f":"Sheet1!AO29+Sheet1!AP29","v":0},{"$f":"Sheet1!AT29+Sheet1!AS29","v":0},{"$f":"Sheet1!AU29+Sheet1!AT29+Sheet1!AV29","v":0},{"$f":"Sheet1!AU29+Sheet1!AV29+Sheet1!AW29","v":0},{"$f":"Sheet1!AU29+Sheet1!AX29+Sheet1!AY29","v":0},{"$f":"Sheet1!AU29+Sheet1!AZ29","v":0},{"$f":"Sheet1!AU29+Sheet1!BA29","v":0},{"$f":"Sheet1!BB29+Sheet1!BC29","v":0},{"$f":"Sheet1!BD29+Sheet1!BE29+Sheet1!BF29","v":0},{"$f":"Sheet1!BD29+Sheet1!BG29","v":0},{"$f":"Sheet1!BH29+Sheet1!BI29","v":0},{"$f":"Sheet1!BI29+Sheet1!BJ29+Sheet1!BK29","v":0},{"$f":"Sheet1!BJ29+Sheet1!BL29","v":0},{"$f":"Sheet1!BM29+Sheet1!BN29","v":0},{"$f":"Sheet1!BO29+Sheet1!BP29+Sheet1!BQ29","v":0},{"$f":"Sheet1!BO29+Sheet1!BR29+Sheet1!BS29","v":0},{"$f":"Sheet1!BO29+Sheet1!BR29+Sheet1!BT29","v":0},{"$f":"Sheet1!BO29+Sheet1!BU29+Sheet1!BT29","v":0},{"$f":"Sheet1!BO29+Sheet1!BT29+Sheet1!BV29","v":0},{"$f":"Sheet1!BW29+Sheet1!BX29","v":0},{"$f":"Sheet1!BW29+Sheet1!BY29+Sheet1!BZ29","v":0},{"$f":"Sheet1!BY29+Sheet1!CA29+Sheet1!CB29","v":0},{"$f":"Sheet1!CA29+Sheet1!CC29","v":0},{"$f":"Sheet1!CA29+Sheet1!CD29","v":0},{"$f":"Sheet1!CD29+Sheet1!CE29+Sheet1!CF29","v":0},{"$f":"Sheet1!CH29+Sheet1!CI29","v":0},{"$f":"Sheet1!CJ29+Sheet1!CK29","v":0},{"$f":"Sheet1!CL29+Sheet1!CM29","v":0},{"$f":"Sheet1!CL29+Sheet1!CN29","v":0},{"$f":"Sheet1!CL29+Sheet1!CO29+Sheet1!CP29","v":0},{"$f":"Sheet1!CL29+Sheet1!CQ29+Sheet1!CR29","v":0},{"$f":"Sheet1!CL29+Sheet1!CS29","v":0},{"$f":"Sheet1!CT29+Sheet1!CU29+Sheet1!CV29","v":0},{"$f":"Sheet1!CW29+Sheet1!CX29+Sheet1!CY29","v":0},{"$f":"Sheet1!CZ29+Sheet1!DA29","v":0},{"$f":"Sheet1!DA29+Sheet1!DB29+Sheet1!DC29","v":0},{"$f":"Sheet1!DD29+Sheet1!DE29","v":0},{"$f":"Sheet1!DE29+Sheet1!DF29","v":0},{"$f":"Sheet1!DG29+Sheet1!DH29","v":0},{"$f":"Sheet1!DJ29+Sheet1!DI29+Sheet1!DK29","v":0},{"$f":"Sheet1!DJ29+Sheet1!DL29+Sheet1!DM29","v":0},{"$f":"Sheet1!DO29+Sheet1!DP29","v":0},{"$f":"Sheet1!DQ29+Sheet1!DR29","v":0},{"$f":"Sheet1!DS29+Sheet1!DT29+Sheet1!DU29","v":0},{"$f":"Sheet1!DS29+Sheet1!DV29+Sheet1!DW29","v":0},{"$f":"Sheet1!DX29+Sheet1!DY29","v":0},{"$f":"Sheet1!DZ29+Sheet1!EA29+Sheet1!EB29","v":0}]
[{"$f":"Sheet1!F30+Sheet1!G30+Sheet1!H30","v":0},{"$f":"Sheet1!J30+Sheet1!K30","v":0},{"$f":"Sheet1!K30+Sheet1!L30","v":0},{"$f":"Sheet1!K30+Sheet1!M30+Sheet1!N30","v":0},{"$f":"Sheet1!O30+Sheet1!P30","v":0},{"$f":"Sheet1!O30+Sheet1!Q30+Sheet1!R30","v":0},{"$f":"Sheet1!O30+Sheet1!S30","v":0},{"$f":"Sheet1!O30+Sheet1!T30","v":0},{"$f":"Sheet1!Q30+Sheet1!R30","v":0},{"$f":"Sheet1!U30+Sheet1!V30+Sheet1!W30","v":0},{"$f":"Sheet1!U30+Sheet1!V30+Sheet1!X30","v":0},{"$f":"Sheet1!Y30+Sheet1!Z30","v":0},{"$f":"Sheet1!Z30+Sheet1!AA30","v":0},{"$f":"Sheet1!Z30+Sheet1!AB30","v":0},{"$f":"Sheet1!AC30+Sheet1!AD30","v":0},{"$f":"Sheet1!AD30+Sheet1!AE30+Sheet1!AF30","v":0},{"$f":"Sheet1!AG30+Sheet1!AH30","v":0},{"$f":"Sheet1!AG30+Sheet1!AI30","v":0},{"$f":"Sheet1!AJ30+Sheet1!AK30","v":0},{"$f":"Sheet1!AL30+Sheet1!AM30","v":0},{"$f":"Sheet1!AO30+Sheet1!AN30","v":0},{"$f":"Sheet1!AO30+Sheet1!AP30","v":0},{"$f":"Sheet1!AT30+Sheet1!AS30","v":0},{"$f":"Sheet1!AU30+Sheet1!AT30+Sheet1!AV30","v":0},{"$f":"Sheet1!AU30+Sheet1!AV30+Sheet1!AW30","v":0},{"$f":"Sheet1!AU30+Sheet1!AX30+Sheet1!AY30","v":0},{"$f":"Sheet1!AU30+Sheet1!AZ30","v":0},{"$f":"Sheet1!AU30+Sheet1!BA30","v":0},{"$f":"Sheet1!BB30+Sheet1!BC30","v":0},{"$f":"Sheet1!BD30+Sheet1!BE30+Sheet1!BF30","v":0},{"$f":"Sheet1!BD30+Sheet1!BG30","v":0},{"$f":"Sheet1!BH30+Sheet1!BI30","v":0},{"$f":"Sheet1!BI30+Sheet1!BJ30+Sheet1!BK30","v":0},{"$f":"Sheet1!BJ30+Sheet1!BL30","v":0},{"$f":"Sheet1!BM30+Sheet1!BN30","v":0},{"$f":"Sheet1!BO30+Sheet1!BP30+Sheet1!BQ30","v":0},{"$f":"Sheet1!BO30+Sheet1!BR30+Sheet1!BS30","v":0},{"$f":"Sheet1!BO30+Sheet1!BR30+Sheet1!BT30","v":0},{"$f":"Sheet1!BO30+Sheet1!BU30+Sheet1!BT30","v":0},{"$f":"Sheet1!BO30+Sheet1!BT30+Sheet1!BV30","v":0},{"$f":"Sheet1!BW30+Sheet1!BX30","v":0},{"$f":"Sheet1!BW30+Sheet1!BY30+Sheet1!BZ30","v":0},{"$f":"Sheet1!BY30+Sheet1!CA30+Sheet1!CB30","v":0},{"$f":"Sheet1!CA30+Sheet1!CC30","v":0},{"$f":"Sheet1!CA30+Sheet1!CD30","v":0},{"$f":"Sheet1!CD30+Sheet1!CE30+Sheet1!CF30","v":0},{"$f":"Sheet1!CH30+Sheet1!CI30","v":0},{"$f":"Sheet1!CJ30+Sheet1!CK30","v":0},{"$f":"Sheet1!CL30+Sheet1!CM30","v":0},{"$f":"Sheet1!CL30+Sheet1!CN30","v":0},{"$f":"Sheet1!CL30+Sheet1!CO30+Sheet1!CP30","v":0},{"$f":"Sheet1!CL30+Sheet1!CQ30+Sheet1!CR30","v":0},{"$f":"Sheet1!CL30+Sheet1!CS30","v":0},{"$f":"Sheet1!CT30+Sheet1!CU30+Sheet1!CV30","v":0},{"$f":"Sheet1!CW30+Sheet1!CX30+Sheet1!CY30","v":0},{"$f":"Sheet1!CZ30+Sheet1!DA30","v":0},{"$f":"Sheet1!DA30+Sheet1!DB30+Sheet1!DC30","v":0},{"$f":"Sheet1!DD30+Sheet1!DE30","v":0},{"$f":"Sheet1!DE30+Sheet1!DF30","v":0},{"$f":"Sheet1!DG30+Sheet1!DH30","v":0},{"$f":"Sheet1!DJ30+Sheet1!DI30+Sheet1!DK30","v":0},{"$f":"Sheet1!DJ30+Sheet1!DL30+Sheet1!DM30","v":0},{"$f":"Sheet1!DO30+Sheet1!DP30","v":0},{"$f":"Sheet1!DQ30+Sheet1!DR30","v":0},{"$f":"Sheet1!DS30+Sheet1!DT30+Sheet1!DU30","v":0},{"$f":"Sheet1!DS30+Sheet1!DV30+Sheet1!DW30","v":0},{"$f":"Sheet1!DX30+Sheet1!DY30","v":0},{"$f":"Sheet1!DZ30+Sheet1!EA30+Sheet1!EB30","v":0}]
[{"$f":"Sheet1!F31+Sheet1!G31+Sheet1!H31","v":0},{"$f":"Sheet1!J31+Sheet1!K31","v":0},{"$f":"Sheet1!K31+Sheet1!L31","v":0},{"$f":"Sheet1!K31+Sheet1!M31+Sheet1!N31","v":0},{"$f":"Sheet1!O31+Sheet1!P31","v":0},{"$f":"Sheet1!O31+Sheet1!Q31+Sheet1!R31","v":0},{"$f":"Sheet1!O31+Sheet1!S31","v":0},{"$f":"Sheet1!O31+Sheet1!T31","v":0},{"$f":"Sheet1!Q31+Sheet1!R31","v":0},{"$f":"Sheet1!U31+Sheet1!V31+Sheet1!W31","v":0},{"$f":"Sheet1!U31+Sheet1!V31+Sheet1!X31","v":0},{"$f":"Sheet1!Y31+Sheet1!Z31","v":0},{"$f":"Sheet1!Z31+Sheet1!AA31","v":0},{"$f":"Sheet1!Z31+Sheet1!AB31","v":0},{"$f":"Sheet1!AC31+Sheet1!AD31","v":0},{"$f":"Sheet1!AD31+Sheet1!AE31+Sheet1!AF31","v":0},{"$f":"Sheet1!AG31+Sheet1!AH31","v":0},{"$f":"Sheet1!AG31+Sheet1!AI31","v":0},{"$f":"Sheet1!AJ31+Sheet1!AK31","v":0},{"$f":"Sheet1!AL31+Sheet1!AM31","v":0},{"$f":"Sheet1!AO31+Sheet1!AN31","v":0},{"$f":"Sheet1!AO31+Sheet1!AP31","v":0},{"$f":"Sheet1!AT31+Sheet1!AS31","v":0},{"$f":"Sheet1!AU31+Sheet1!AT31+Sheet1!AV31","v":0},{"$f":"Sheet1!AU31+Sheet1!AV31+Sheet1!AW31","v":0},{"$f":"Sheet1!AU31+Sheet1!AX31+Sheet1!AY31","v":0},{"$f":"Sheet1!AU31+Sheet1!AZ31","v":0},{"$f":"Sheet1!AU31+Sheet1!BA31","v":0},{"$f":"Sheet1!BB31+Sheet1!BC31","v":0},{"$f":"Sheet1!BD31+Sheet1!BE31+Sheet1!BF31","v":0},{"$f":"Sheet1!BD31+Sheet1!BG31","v":0},{"$f":"Sheet1!BH31+Sheet1!BI31","v":0},{"$f":"Sheet1!BI31+Sheet1!BJ31+Sheet1!BK31","v":0},{"$f":"Sheet1!BJ31+Sheet1!BL31","v":0},{"$f":"Sheet1!BM31+Sheet1!BN31","v":0},{"$f":"Sheet1!BO31+Sheet1!BP31+Sheet1!BQ31","v":0},{"$f":"Sheet1!BO31+Sheet1!BR31+Sheet1!BS31","v":0},{"$f":"Sheet1!BO31+Sheet1!BR31+Sheet1!BT31","v":0},{"$f":"Sheet1!BO31+Sheet1!BU31+Sheet1!BT31","v":0},{"$f":"Sheet1!BO31+Sheet1!BT31+Sheet1!BV31","v":0},{"$f":"Sheet1!BW31+Sheet1!BX31","v":0},{"$f":"Sheet1!BW31+Sheet1!BY31+Sheet1!BZ31","v":0},{"$f":"Sheet1!BY31+Sheet1!CA31+Sheet1!CB31","v":0},{"$f":"Sheet1!CA31+Sheet1!CC31","v":0},{"$f":"Sheet1!CA31+Sheet1!CD31","v":0},{"$f":"Sheet1!CD31+Sheet1!CE31+Sheet1!CF31","v":0},{"$f":"Sheet1!CH31+Sheet1!CI31","v":0},{"$f":"Sheet1!CJ31+Sheet1!CK31","v":0},{"$f":"Sheet1!CL31+Sheet1!CM31","v":0},{"$f":"Sheet1!CL31+Sheet1!CN31","v":0},{"$f":"Sheet1!CL31+Sheet1!CO31+Sheet1!CP31","v":0},{"$f":"Sheet1!CL31+Sheet1!CQ31+Sheet1!CR31","v":0},{"$f":"Sheet1!CL31+Sheet1!CS31","v":0},{"$f":"Sheet1!CT31+Sheet1!CU31+Sheet1!CV31","v":0},{"$f":"Sheet1!CW31+Sheet1!CX31+Sheet1!CY31","v":0},{"$f":"Sheet1!CZ31+Sheet1!DA31","v":0},{"$f":"Sheet1!DA31+Sheet1!DB31+Sheet1!DC31","v":0},{"$f":"Sheet1!DD31+Sheet1!DE31","v":0},{"$f":"Sheet1!DE31+Sheet1!DF31","v":0},{"$f":"Sheet1!DG31+Sheet1!DH31","v":0},{"$f":"Sheet1!DJ31+Sheet1!DI31+Sheet1!DK31","v":0},{"$f":"Sheet1!DJ31+Sheet1!DL31+Sheet1!DM31","v":0},{"$f":"Sheet1!DO31+Sheet1!DP31","v":0},{"$f":"Sheet1!DQ31+Sheet1!DR31","v":0},{"$f":"Sheet1!DS31+Sheet1!DT31+Sheet1!DU31","v":0},{"$f":"Sheet1!DS31+Sheet1!DV31+Sheet1!DW31","v":0},{"$f":"Sheet1!DX31+Sheet1!DY31","v":0},{"$f":"Sheet1!DZ31+Sheet1!EA31+Sheet1!EB31","v":0}]
[{"$f":"Sheet1!F32+Sheet1!G32+Sheet1!H32","v":0},{"$f":"Sheet1!J32+Sheet1!K32","v":0},{"$f":"Sheet1!K32+Sheet1!L32","v":0},{"$f":"Sheet1!K32+Sheet1!M32+Sheet1!N32","v":0},{"$f":"Sheet1!O32+Sheet1!P32","v":0},{"$f":"Sheet1!O32+Sheet1!Q32+Sheet1!R32","v":0},{"$f":"Sheet1!O32+Sheet1!S32","v":0},{"$f":"Sheet1!O32+Sheet1!T32","v":0},{"$f":"Sheet1!Q32+Sheet1!R32","v":0},{"$f":"Sheet1!U32+Sheet1!V32+Sheet1!W32","v":0},{"$f":"Sheet1!U32+Sheet1!V32+Sheet1!X32","v":0},{"$f":"Sheet1!Y32+Sheet1!Z32","v":0},{"$f":"Sheet1!Z32+Sheet1!AA32","v":0},{"$f":"Sheet1!Z32+Sheet1!AB32","v":0},{"$f":"Sheet1!AC32+Sheet1!AD32","v":0},{"$f":"Sheet1!AD32+Sheet1!AE32+Sheet1!AF32","v":0},{"$f":"Sheet1!AG32+Sheet1!AH32","v":0},{"$f":"Sheet1!AG32+Sheet1!AI32","v":0},{"$f":"Sheet1!AJ32+Sheet1!AK32","v":0},{"$f":"Sheet1!AL32+Sheet1!AM32","v":0},{"$f":"Sheet1!AO32+Sheet1!AN32","v":0},{"$f":"Sheet1!AO32+Sheet1!AP32","v":0},{"$f":"Sheet1!AT32+Sheet1!AS32","v":0},{"$f":"Sheet1!AU32+Sheet1!AT32+Sheet1!AV32","v":0},{"$f":"Sheet1!AU32+Sheet1!AV32+Sheet1!AW32","v":0},{"$f":"Sheet1!AU32+Sheet1!AX32+Sheet1!AY32","v":0},{"$f":"Sheet1!AU32+Sheet1!AZ32","v":0},{"$f":"Sheet1!AU32+Sheet1!BA32","v":0},{"$f":"Sheet1!BB32+Sheet1!BC32","v":0},{"$f":"Sheet1!BD32+Sheet1!BE32+Sheet1!BF32","v":0},{"$f":"Sheet1!BD32+Sheet1!BG32","v":0},{"$f":"Sheet1!BH32+Sheet1!BI32","v":0},{"$f":"Sheet1!BI32+Sheet1!BJ32+Sheet1!BK32","v":0},{"$f":"Sheet1!BJ32+Sheet1!BL32","v":0},{"$f":"Sheet1!BM32+Sheet1!BN32","v":0},{"$f":"Sheet1!BO32+Sheet1!BP32+Sheet1!BQ32","v":0},{"$f":"Sheet1!BO32+Sheet1!BR32+Sheet1!BS32","v":0},{"$f":"Sheet1!BO32+Sheet1!BR32+Sheet1!BT32","v":0},{"$f":"Sheet1!BO32+Sheet1!BU32+Sheet1!BT32","v":0},{"$f":"Sheet1!BO32+Sheet1!BT32+Sheet1!BV32","v":0},{"$f":"Sheet1!BW32+Sheet1!BX32","v":0},{"$f":"Sheet1!BW32+Sheet1!BY32+Sheet1!BZ32","v":0},{"$f":"Sheet1!BY32+Sheet1!CA32+Sheet1!CB32","v":0},{"$f":"Sheet1!CA32+Sheet1!CC32","v":0},{"$f":"Sheet1!CA32+Sheet1!CD32","v":0},{"$f":"Sheet1!CD32+Sheet1!CE32+Sheet1!CF32","v":0},{"$f":"Sheet1!CH32+Sheet1!CI32","v":0},{"$f":"Sheet1!CJ32+Sheet1!CK32","v":0},{"$f":"Sheet1!CL32+Sheet1!CM32","v":0},{"$f":"Sheet1!CL32+Sheet1!CN32","v":0},{"$f":"Sheet1!CL32+Sheet1!CO32+Sheet1!CP32","v":0},{"$f":"Sheet1!CL32+Sheet1!CQ32+Sheet1!CR32","v":0},{"$f":"Sheet1!CL32+Sheet1!CS32","v":0},{"$f":"Sheet1!CT32+Sheet1!CU32+Sheet1!CV32","v":0},{"$f":"Sheet1!CW32+Sheet1!CX32+Sheet1!CY32","v":0},{"$f":"Sheet1!CZ32+Sheet1!DA32","v":0},{"$f":"Sheet1!DA32+Sheet1!DB32+Sheet1!DC32","v":0},{"$f":"Sheet1!DD32+Sheet1!DE32","v":0},{"$f":"Sheet1!DE32+Sheet1!DF32","v":0},{"$f":"Sheet1!DG32+Sheet1!DH32","v":0},{"$f":"Sheet1!DJ32+Sheet1!DI32+Sheet1!DK32","v":0},{"$f":"Sheet1!DJ32+Sheet1!DL32+Sheet1!DM32","v":0},{"$f":"Sheet1!DO32+Sheet1!DP32","v":0},{"$f":"Sheet1!DQ32+Sheet1!DR32","v":0},{"$f":"Sheet1!DS32+Sheet1!DT32+Sheet1!DU32","v":0},{"$f":"Sheet1!DS32+Sheet1!DV32+Sheet1!DW32","v":0},{"$f":"Sheet1!DX32+Sheet1!DY32","v":0},{"$f":"Sheet1!DZ32+Sheet1!EA32+Sheet1!EB32","v":0}]
[{"$f":"Sheet1!F33+Sheet1!G33+Sheet1!H33","v":0},{"$f":"Sheet1!J33+Sheet1!K33","v":0},{"$f":"Sheet1!K33+Sheet1!L33","v":0},{"$f":"Sheet1!K33+Sheet1!M33+Sheet1!N33","v":0},{"$f":"Sheet1!O33+Sheet1!P33","v":0},{"$f":"Sheet1!O33+Sheet1!Q33+Sheet1!R33","v":0},{"$f":"Sheet1!O33+Sheet1!S33","v":0},{"$f":"Sheet1!O33+Sheet1!T33","v":0},{"$f":"Sheet1!Q33+Sheet1!R33","v":0},{"$f":"Sheet1!U33+Sheet1!V33+Sheet1!W33","v":0},{"$f":"Sheet1!U33+Sheet1!V33+Sheet1!X33","v":0},{"$f":"Sheet1!Y33+Sheet1!Z33","v":0},{"$f":"Sheet1!Z33+Sheet1!AA33","v":0},{"$f":"Sheet1!Z33+Sheet1!AB33","v":0},{"$f":"Sheet1!AC33+Sheet1!AD33","v":0},{"$f":"Sheet1!AD33+Sheet1!AE33+Sheet1!AF33","v":0},{"$f":"Sheet1!AG33+Sheet1!AH33","v":0},{"$f":"Sheet1!AG33+Sheet1!AI33","v":0},{"$f":"Sheet1!AJ33+Sheet1!AK33","v":0},{"$f":"Sheet1!AL33+Sheet1!AM33","v":0},{"$f":"Sheet1!AO33+Sheet1!AN33","v":0},{"$f":"Sheet1!AO33+Sheet1!AP33","v":0},{"$f":"Sheet1!AT33+Sheet1!AS33","v":0},{"$f":"Sheet1!AU33+Sheet1!AT33+Sheet1!AV33","v":0},{"$f":"Sheet1!AU33+Sheet1!AV33+Sheet1!AW33","v":0},{"$f":"Sheet1!AU33+Sheet1!AX33+Sheet1!AY33","v":0},{"$f":"Sheet1!AU33+Sheet1!AZ33","v":0},{"$f":"Sheet1!AU33+Sheet1!BA33","v":0},{"$f":"Sheet1!BB33+Sheet1!BC33","v":0},{"$f":"Sheet1!BD33+Sheet1!BE33+Sheet1!BF33","v":0},{"$f":"Sheet1!BD33+Sheet1!BG33","v":0},{"$f":"Sheet1!BH33+Sheet1!BI33","v":0},{"$f":"Sheet1!BI33+Sheet1!BJ33+Sheet1!BK33","v":0},{"$f":"Sheet1!BJ33+Sheet1!BL33","v":0},{"$f":"Sheet1!BM33+Sheet1!BN33","v":0},{"$f":"Sheet1!BO33+Sheet1!BP33+Sheet1!BQ33","v":0},{"$f":"Sheet1!BO33+Sheet1!BR33+Sheet1!BS33","v":0},{"$f":"Sheet1!BO33+Sheet1!BR33+Sheet1!BT33","v":0},{"$f":"Sheet1!BO33+Sheet1!BU33+Sheet1!BT33","v":0},{"$f":"Sheet1!BO33+Sheet1!BT33+Sheet1!BV33","v":0},{"$f":"Sheet1!BW33+Sheet1!BX33","v":0},{"$f":"Sheet1!BW33+Sheet1!BY33+Sheet1!BZ33","v":0},{"$f":"Sheet1!BY33+Sheet1!CA33+Sheet1!CB33","v":0},{"$f":"Sheet1!CA33+Sheet1!CC33","v":0},{"$f":"Sheet1!CA33+Sheet1!CD33","v":0},{"$f":"Sheet1!CD33+Sheet1!CE33+Sheet1!CF33","v":0},{"$f":"Sheet1!CH33+Sheet1!CI33","v":0},{"$f":"Sheet1!CJ33+Sheet1!CK33","v":0},{"$f":"Sheet1!CL33+Sheet1!CM33","v":0},{"$f":"Sheet1!CL33+Sheet1!CN33","v":0},{"$f":"Sheet1!CL33+Sheet1!CO33+Sheet1!CP33","v":0},{"$f":"Sheet1!CL33+Sheet1!CQ33+Sheet1!CR33","v":0},{"$f":"Sheet1!CL33+Sheet1!CS33","v":0},{"$f":"Sheet1!CT33+Sheet1!CU33+Sheet1!CV33","v":0},{"$f":"Sheet1!CW33+Sheet1!CX33+Sheet1!CY33","v":0},{"$f":"Sheet1!CZ33+Sheet1!DA33","v":0},{"$f":"Sheet1!DA33+Sheet1!DB33+Sheet1!DC33","v":0},{"$f":"Sheet1!DD33+Sheet1!DE33","v":0},{"$f":"Sheet1!DE33+Sheet1!DF33","v":0},{"$f":"Sheet1!DG33+Sheet1!DH33","v":0},{"$f":"Sheet1!DJ33+Sheet1!DI33+Sheet1!DK33","v":0},{"$f":"Sheet1!DJ33+Sheet1!DL33+Sheet1!DM33","v":0},{"$f":"Sheet1!DO33+Sheet1!DP33","v":0},{"$f":"Sheet1!DQ33+Sheet1!DR33","v":0},{"$f":"Sheet1!DS33+Sheet1!DT33+Sheet1!DU33","v":0},{"$f":"Sheet1!DS33+Sheet1!DV33+Sheet1!DW33","v":0},{"$f":"Sheet1!DX33+Sheet1!DY33","v":0},{"$f":"Sheet1!DZ33+Sheet1!EA33+Sheet1!EB33","v":0}]
[{"$f":"Sheet1!F34+Sheet1!G34+Sheet1!H34","v":0},{"$f":"Sheet1!J34+Sheet1!K34","v":0},{"$f":"Sheet1!K34+Sheet1!L34","v":0},{"$f":"Sheet1!K34+Sheet1!M34+Sheet1!N34","v":0},{"$f":"Sheet1!O34+Sheet1!P34","v":0},{"$f":"Sheet1!O34+Sheet1!Q34+Sheet1!R34","v":0},{"$f":"Sheet1!O34+Sheet1!S34","v":0},{"$f":"Sheet1!O34+Sheet1!T34","v":0},{"$f":"Sheet1!Q34+Sheet1!R34","v":0},{"$f":"Sheet1!U34+Sheet1!V34+Sheet1!W34","v":0},{"$f":"Sheet1!U34+Sheet1!V34+Sheet1!X34","v":0},{"$f":"Sheet1!Y34+Sheet1!Z34","v":0},{"$f":"Sheet1!Z34+Sheet1!AA34","v":0},{"$f":"Sheet1!Z34+Sheet1!AB34","v":0},{"$f":"Sheet1!AC34+Sheet1!AD34","v":0},{"$f":"Sheet1!AD34+Sheet1!AE34+Sheet1!AF34","v":0},{"$f":"Sheet1!AG34+Sheet1!AH34","v":0},{"$f":"Sheet1!AG34+Sheet1!AI34","v":0},{"$f":"Sheet1!AJ34+Sheet1!AK34","v":0},{"$f":"Sheet1!AL34+Sheet1!AM34","v":0},{"$f":"Sheet1!AO34+Sheet1!AN34","v":0},{"$f":"Sheet1!AO34+Sheet1!AP34","v":0},{"$f":"Sheet1!AT34+Sheet1!AS34","v":0},{"$f":"Sheet1!AU34+Sheet1!AT34+Sheet1!AV34","v":0},{"$f":"Sheet1!AU34+Sheet1!AV34+Sheet1!AW34","v":0},{"$f":"Sheet1!AU34+Sheet1!AX34+Sheet1!AY34","v":0},{"$f":"Sheet1!AU34+Sheet1!AZ34","v":0},{"$f":"Sheet1!AU34+Sheet1!BA34","v":0},{"$f":"Sheet1!BB34+Sheet1!BC34","v":0},{"$f":"Sheet1!BD34+Sheet1!BE34+Sheet1!BF34","v":0},{"$f":"Sheet1!BD34+Sheet1!BG34","v":0},{"$f":"Sheet1!BH34+Sheet1!BI34","v":0},{"$f":"Sheet1!BI34+Sheet1!BJ34+Sheet1!BK34","v":0},{"$f":"Sheet1!BJ34+Sheet1!BL34","v":0},{"$f":"Sheet1!BM34+Sheet1!BN34","v":0},{"$f":"Sheet1!BO34+Sheet1!BP34+Sheet1!BQ34","v":0},{"$f":"Sheet1!BO34+Sheet1!BR34+Sheet1!BS34","v":0},{"$f":"Sheet1!BO34+Sheet1!BR34+Sheet1!BT34","v":0},{"$f":"Sheet1!BO34+Sheet1!BU34+Sheet1!BT34","v":0},{"$f":"Sheet1!BO34+Sheet1!BT34+Sheet1!BV34","v":0},{"$f":"Sheet1!BW34+Sheet1!BX34","v":0},{"$f":"Sheet1!BW34+Sheet1!BY34+Sheet1!BZ34","v":0},{"$f":"Sheet1!BY34+Sheet1!CA34+Sheet1!CB34","v":0},{"$f":"Sheet1!CA34+Sheet1!CC34","v":0},{"$f":"Sheet1!CA34+Sheet1!CD34","v":0},{"$f":"Sheet1!CD34+Sheet1!CE34+Sheet1!CF34","v":0},{"$f":"Sheet1!CH34+Sheet1!CI34","v":0},{"$f":"Sheet1!CJ34+Sheet1!CK34","v":0},{"$f":"Sheet1!CL34+Sheet1!CM34","v":0},{"$f":"Sheet1!CL34+Sheet1!CN34","v":0},{"$f":"Sheet1!CL34+Sheet1!CO34+Sheet1!CP34","v":0},{"$f":"Sheet1!CL34+Sheet1!CQ34+Sheet1!CR34","v":0},{"$f":"Sheet1!CL34+Sheet1!CS34","v":0},{"$f":"Sheet1!CT34+Sheet1!CU34+Sheet1!CV34","v":0},{"$f":"Sheet1!CW34+Sheet1!CX34+Sheet1!CY34","v":0},{"$f":"Sheet1!CZ34+Sheet1!DA34","v":0},{"$f":"Sheet1!DA34+Sheet1!DB34+Sheet1!DC34","v":0},{"$f":"Sheet1!DD34+Sheet1!DE34","v":0},{"$f":"Sheet1!DE34+Sheet1!DF34","v":0},{"$f":"Sheet1!DG34+Sheet1!DH34","v":0},{"$f":"Sheet1!DJ34+Sheet1!DI34+Sheet1!DK34","v":0},{"$f":"Sheet1!DJ34+Sheet1!DL34+Sheet1!DM34","v":0},{"$f":"Sheet1!DO34+Sheet1!DP34","v":0},{"$f":"Sheet1!DQ34+Sheet1!DR34","v":0},{"$f":"Sheet1!DS34+Sheet1!DT34+Sheet1!DU34","v":0},{"$f":"Sheet1!DS34+Sheet1!DV34+Sheet1!DW34","v":0},{"$f":"Sheet1!DX34+Sheet1!DY34","v":0},{"$f":"Sheet1!DZ34+Sheet1!EA34+Sheet1!EB34","v":0}]
[{"$f":"Sheet1!F35+Sheet1!G35+Sheet1!H35","v":0},{"$f":"Sheet1!J35+Sheet1!K35","v":0},{"$f":"Sheet1!K35+Sheet1!L35","v":0},{"$f":"Sheet1!K35+Sheet1!M35+Sheet1!N35","v":0},{"$f":"Sheet1!O35+Sheet1!P35","v":0},{"$f":"Sheet1!O35+Sheet1!Q35+Sheet1!R35","v":0},{"$f":"Sheet1!O35+Sheet1!S35","v":0},{"$f":"Sheet1!O35+Sheet1!T35","v":0},{"$f":"Sheet1!Q35+Sheet1!R35","v":0},{"$f":"Sheet1!U35+Sheet1!V35+Sheet1!W35","v":0},{"$f":"Sheet1!U35+Sheet1!V35+Sheet1!X35","v":0},{"$f":"Sheet1!Y35+Sheet1!Z35","v":0},{"$f":"Sheet1!Z35+Sheet1!AA35","v":0},{"$f":"Sheet1!Z35+Sheet1!AB35","v":0},{"$f":"Sheet1!AC35+Sheet1!AD35","v":0},{"$f":"Sheet1!AD35+Sheet1!AE35+Sheet1!AF35","v":0},{"$f":"Sheet1!AG35+Sheet1!AH35","v":0},{"$f":"Sheet1!AG35+Sheet1!AI35","v":0},{"$f":"Sheet1!AJ35+Sheet1!AK35","v":0},{"$f":"Sheet1!AL35+Sheet1!AM35","v":0},{"$f":"Sheet1!AO35+Sheet1!AN35","v":0},{"$f":"Sheet1!AO35+Sheet1!AP35","v":0},{"$f":"Sheet1!AT35+Sheet1!AS35","v":0},{"$f":"Sheet1!AU35+Sheet1!AT35+Sheet1!AV35","v":0},{"$f":"Sheet1!AU35+Sheet1!AV35+Sheet1!AW35","v":0},{"$f":"Sheet1!AU35+Sheet1!AX35+Sheet1!AY35","v":0},{"$f":"Sheet1!AU35+Sheet1!AZ35","v":0},{"$f":"Sheet1!AU35+Sheet1!BA35","v":0},{"$f":"Sheet1!BB35+Sheet1!BC35","v":0},{"$f":"Sheet1!BD35+Sheet1!BE35+Sheet1!BF35","v":0},{"$f":"Sheet1!BD35+Sheet1!BG35","v":0},{"$f":"Sheet1!BH35+Sheet1!BI35","v":0},{"$f":"Sheet1!BI35+Sheet1!BJ35+Sheet1!BK35","v":0},{"$f":"Sheet1!BJ35+Sheet1!BL35","v":0},{"$f":"Sheet1!BM35+Sheet1!BN35","v":0},{"$f":"Sheet1!BO35+Sheet1!BP35+Sheet1!BQ35","v":0},{"$f":"Sheet1!BO35+Sheet1!BR35+Sheet1!BS35","v":0},{"$f":"Sheet1!BO35+Sheet1!BR35+Sheet1!BT35","v":0},{"$f":"Sheet1!BO35+Sheet1!BU35+Sheet1!BT35","v":0},{"$f":"Sheet1!BO35+Sheet1!BT35+Sheet1!BV35","v":0},{"$f":"Sheet1!BW35+Sheet1!BX35","v":0},{"$f":"Sheet1!BW35+Sheet1!BY35+Sheet1!BZ35","v":0},{"$f":"Sheet1!BY35+Sheet1!CA35+Sheet1!CB35","v":0},{"$f":"Sheet1!CA35+Sheet1!CC35","v":0},{"$f":"Sheet1!CA35+Sheet1!CD35","v":0},{"$f":"Sheet1!CD35+Sheet1!CE35+Sheet1!CF35","v":0},{"$f":"Sheet1!CH35+Sheet1!CI35","v":0},{"$f":"Sheet1!CJ35+Sheet1!CK35","v":0},{"$f":"Sheet1!CL35+Sheet1!CM35","v":0},{"$f":"Sheet1!CL35+Sheet1!CN35","v":0},{"$f":"Sheet1!CL35+Sheet1!CO35+Sheet1!CP35","v":0},{"$f":"Sheet1!CL35+Sheet1!CQ35+Sheet1!CR35","v":0},{"$f":"Sheet1!CL35+Sheet1!CS35","v":0},{"$f":"Sheet1!CT35+Sheet1!CU35+Sheet1!CV35","v":0},{"$f":"Sheet1!CW35+Sheet1!CX35+Sheet1!CY35","v":0},{"$f":"Sheet1!CZ35+Sheet1!DA35","v":0},{"$f":"Sheet1!DA35+Sheet1!DB35+Sheet1!DC35","v":0},{"$f":"Sheet1!DD35+Sheet1!DE35","v":0},{"$f":"Sheet1!DE35+Sheet1!DF35","v":0},{"$f":"Sheet1!DG35+Sheet1!DH35","v":0},{"$f":"Sheet1!DJ35+Sheet1!DI35+Sheet1!DK35","v":0},{"$f":"Sheet1!DJ35+Sheet1!DL35+Sheet1!DM35","v":0},{"$f":"Sheet1!DO35+Sheet1!DP35","v":0},{"$f":"Sheet1!DQ35+Sheet1!DR35","v":0},{"$f":"Sheet1!DS35+Sheet1!DT35+Sheet1!DU35","v":0},{"$f":"Sheet1!DS35+Sheet1!DV35+Sheet1!DW35","v":0},{"$f":"Sheet1!DX35+Sheet1!DY35","v":0},{"$f":"Sheet1!DZ35+Sheet1!EA35+Sheet1!EB35","v":0}]